{"text_format":"1","workbook":"xlsx","n_sheets":35,"sheets":["開通案内","データシート","設定値リスト","FastHelp_顧客","FastHelp_契約","【参照】IPv4 IPv6 提供機能比較表","【参照】IPv6契約・アクセス回線","現場設定変更","①【ルーター】機能選択シート","②【ルーター】システム設定","③【ルーター】回線プロバイダ設定","④【ルーター】タグVLAN設定","⑤【ルーター】拠点間IPSec接続先","⑥【ルーター】リモートアクセス接続先","⑦【ルーター】カメラや公開サーバ設定","⑧【ルーター】経路設定","⑨【ルーター】静的IPフィルタ設定","⑩【ルーター】NAT設定","⑪【スイッチ➊】01.システム設定","⑫【スイッチ➊】02.タグVLAN設定","⑬【スイッチ➊】03.静的MACアドレステーブル","⑪【スイッチ➋】01.システム設定","⑫【スイッチ➋】02.タグVLAN設定","⑬【スイッチ➋】03.静的MACアドレステーブル","⑪【スイッチ❸】01.システム設定","⑫【スイッチ❸】02.タグVLAN設定","⑬【スイッチ❸】03.静的MACアドレステーブル","⑪【スイッチ❹】01.システム設定","⑫【スイッチ❹】02.タグVLAN設定","⑬【スイッチ❹】03.静的MACアドレステーブル","⑪【スイッチ➎】01.システム設定","⑫【スイッチ➎】02.タグVLAN設定","⑬【スイッチ➎】03.静的MACアドレステーブル","ネットワーク構成図","ルーター設置場所"],"not_rendered":{"charts":0,"images":18,"macros":1,"external_links":17,"defined_names":394,"comments":0,"pivot_tables":0},"unopened":[],"bounds":{"document_bytes":16777216,"sheet_cells":100000,"rows_first":2000,"rows_last":500,"rows_between":2000,"halvings":0,"cell_chars":16384,"cell_head_chars":4096},"cells_cut":0,"cells_raw":0,"read":"whole","date_system":"1900"}

{"sheet":"開通案内","index":0,"n_rows":44,"n_cols":6,"rows_kept":44,"cut":false,"hidden":true,"merged":[[43,1,43,2],[43,3,43,5],[37,1,37,2],[37,3,37,4],[38,1,38,2],[38,3,38,4],[41,1,42,2],[41,3,42,5],[34,1,34,2],[34,3,34,4],[35,1,35,2],[35,3,35,4],[36,1,36,2],[36,3,36,4],[33,1,33,2],[33,3,33,4],[20,2,20,5],[21,2,21,5],[22,2,22,5],[23,2,23,5],[24,2,24,5],[25,2,25,5],[28,2,28,5],[31,1,31,2],[31,3,31,4],[32,1,32,2],[32,3,32,4],[19,2,19,5],[1,1,6,2],[9,1,9,5],[11,1,11,5],[12,1,12,5],[18,2,18,5]]}
[]
[null,{"$f":"#REF!&#REF!&#REF!& CHAR(10)&#REF!&#REF!&#REF!&#REF!&\"　\"&\"様\"","v":{"$error":"#REF!"}}]
[]
[]
[]
[]
[]
[]
[]
[null,"＜ルータおまかせプラン　お申し込み内容のご案内＞"]
[]
[null,"　この度は、弊社サービスをお申し込みいただきまして誠にありがとうございます。お申し込みいただきましたお客さまのご利用内容を以下の通りご案内申し上げます。"]
[null,"　なお、この書面については、大切に保管していただきますようお願い申し上げます。"]
[]
[null,"なお、機器到着後は、同梱の手順書に従い機器を接続の上、本紙下部に記載の「ご契約者様専用　お問合せ窓口」まで"]
[null,"ご一報いただきますようお願いいたします。"]
[]
[null,"◆お客さま情報",null,null,null,"　　　　年　　月　　日　　発行"]
[null,"ご契約者名",{"$f":"#REF!","v":{"$error":"#REF!"}}]
[null,"お申込者さま",{"$f":"#REF!&#REF!","v":{"$error":"#REF!"}}]
[null,"課金先回線ID",{"$f":"#REF!","v":{"$error":"#REF!"}}]
[null,"ご利用場所住所",{"$f":"#REF!&#REF!&#REF!","v":{"$error":"#REF!"}}]
[null,"ご契約ID",{"$f":"#REF!","v":{"$error":"#REF!"}}]
[null,"クラウド管理サーバーログインID",{"$f":"#REF!","v":{"$error":"#REF!"}}]
[null,"クラウド管理サーバーログインパスワード",{"$f":"#REF!","v":{"$error":"#REF!"}}]
[null,"クラウド管理サーバーＵＲＬ","http://yno.co.jp"]
[]
[null,"◆ご利用開始情報"]
[null,"ご利用開始年月日",{"$f":"#REF!","v":{"$error":"#REF!"}}]
[]
[null,"◆お申し込み商品詳細"]
[null,"商　品　名",null,"契約数",null,"月額利用料金（税抜）"]
[null,{"$f":"#REF!","v":{"$error":"#REF!"}},null,"-",null,{"$f":"VLOOKUP(#REF!,データシート!$D$3:$E$8,2,FALSE)","v":{"$error":"#REF!"}}]
[null,"スイッチオプション　ベーシックタイプ5年型",null,{"$f":"#REF!","v":{"$error":"#REF!"}},null,{"$f":"D34*270","v":{"$error":"#REF!"}}]
[null,"スイッチオプション　ベーシックタイプ7年型",null,{"$f":"#REF!","v":{"$error":"#REF!"}},null,{"$f":"D35*200","v":{"$error":"#REF!"}}]
[null,"スイッチオプション　ハイエンドタイプ5年型",null,{"$f":"#REF!","v":{"$error":"#REF!"}},null,{"$f":"D36*3200","v":{"$error":"#REF!"}}]
[null,"スイッチオプション　ハイエンドタイプ7年型",null,{"$f":"#REF!","v":{"$error":"#REF!"}},null,{"$f":"D37*2300","v":{"$error":"#REF!"}}]
[null,"【割引】オフィスネットおまかせサポートサービス基本メニューまたは、\n　　　　「オフサポ基本メニュー（MDM利用時）」の同時ご利用",null,"-",null,{"$f":"IF(#REF!=\"■\",\"▲500\",\"-\")","v":{"$error":"#REF!"}}]
[null,"【割引】セキュリティおまかせプランまたは、スマート光ビジネスWi-Fiの同時ご利用",null,"-",null,{"$f":"IF(#REF!=\"■\",\"▲500\",IF(#REF!=\"■\",\"▲500\",\"-\"))","v":{"$error":"#REF!"}}]
[]
[null,"◆本サービスに関するお問い合わせ先電話番号/ホームページ"]
[null,"ご契約者様専用　お問合せ窓口",null,"電話番号：0800-200-2368\n受付時間：9時～21時（３６５日）※年末年始（12月29日～1月3日）除く"]
[]
[null,"NTT西日本 ホームページ",null,"https://flets-w.com/solution/plan/router_omakase/"]

{"sheet":"データシート","index":1,"n_rows":32,"n_cols":38,"rows_kept":32,"cut":false,"hidden":true,"merged":[]}
[null,null,null,null,null,null,null,null,null,null,null,null,null,null,null,null,null,null,null,null,null,null,null,null,null,null,"①【ルーター】機能選択シート＜IPoEサービス名称＞",null,null,null,null,null,null,null,null,null,"⑤【ルーター】拠点間IPSec接続先"]
[null,null,null,null,null,null,null,null,null,null,null,null,null,null,null,null,null,null,null,null,null,null,null,null,null,null,"利用有無","機能一覧","備考",null,null,null,null,null,null,null,"認証アルゴリズム","暗号アルゴリズム"]
[null,"富山県","契約者情報と同じ","ベーシックタイプ_5年月額支払い型",4500,0,"□","なし","申込者情報と同じ","契約者情報と同じ","ネクスト（課金CAF番号と同一回線：コラボ・マイタウン含む)","販売担当者と同じ","□","新規","新規／追加／廃止","SO工事",null,null,null,null,null,null,null,null,null,null,"□","IPv6 IPoEサービス（IPv4 over IPv6）の利用","IPv6 IPoEサービス（IPv4 over IPv6）の種類\n\n・OCN光：OCN光 IPv6 IPoEサービス（IPv4 over IPv6）の利用\n・BizConecta：BizConecta IPv6 IPoEサービス（IPv4 over Ipv6）の利用\n・v6コネクト：v6コネクト IPv6 IPoEサービス（IPv4 over Ipv6）の利用",null,null,null,null,null,null,null,"HMAC-SHA","AES-CBC"]
[null,"石川県","契約者情報と異なる","ベーシックタイプ_7年月額支払い型",4000,1,"■","親","申込者情報と異なる","設置場所情報と同じ","ネクスト(課金CAF番号と違う回線：コラボ・マイタウン含む) ","その他","■","追加(オプション)","変更","内製(営業/SE)",null,null,null,null,null,null,null,null,null,null,"■　\nOCN光","OCN光 IPv6 IPoEサービス（IPv4 over IPv6）接続の利用","OCN光 IPv6 IPoEサービス（IPv4 over IPv6）接続の設定を行います。\n・本サービスの利用には、別途、契約が必要です。必要な契約については、「【参照】IPv6契約・アクセス回線」シートに記しておりますので、そちらをご覧ください。\n・本サービスを利用可能な回線については、「【参照】IPv6契約・アクセス回線」シートに記しておりますので、そちらをご覧ください。\n・本サービスにより、提供できる／できない機能については、「【参照】提供可能なサービス」シートに記しておりますので、そちらをご覧下さい。\n・本サービスをご利用の場合、訪問保守オプションは「インターネット直収されていないルーター」の作業内容となります。(夜間対応不可となります)\n※IPv4 PPPoEによるインターネット接続につきましては、「 2. プロバイダー（ISP）の利用」が対象です。\n※プロバイダー（ISP）をご利用の場合には、OCN光 IPv6 IPoEサービス（IPv4 over IPv6）をご利用になれません。また、IPv4 PPPoEと IPv4 over IPv6との重畳接続は不可です。\n※シェアードアドレス(動的IP)契約の場合、外部からお客様環境内のパソコンやNW機器にアクセスはできません。\n※ひかりクラウドPBXは本サービス適用外です。",null,null,null,null,null,null,null,"HMAC-SHA256","AES256-CBC"]
[null,"福井県",null,"ハイエンドタイプ_5年月額支払い型",5000,2,null,"子",null,"その他","その他",null,null,"廃止(全て)",null,"お客様",null,null,null,null,null,null,null,null,null,null,"■　\nBizConecta","BizConecta IPv6 IPoEサービス（IPv4 over IPv6）接続の利用","BizConecta IPv6 IPoEサービス（IPv4 over IPv6）接続の設定を行います。\n・本サービスの利用には、別途、契約が必要です。必要な契約については、「【参照】IPv6契約・アクセス回線」シートに記しておりますので、そちらをご覧ください。\n・本サービスを利用可能な回線については、「【参照】IPv6契約・アクセス回線」シートに記しておりますので、そちらをご覧ください。\n・本サービスにより、提供できる／できない機能については、「【参照】提供可能なサービス」シートに記しておりますので、そちらをご覧下さい。\n・本サービスをご利用の場合、訪問保守オプションは「インターネット直収されていないルーター」の作業内容となります。(夜間対応不可となります)\n※IPv4 PPPoEによるインターネット接続につきましては、「 2. プロバイダー（ISP）の利用」が対象です。\n※プロバイダー（ISP）をご利用の場合には、BizConecta IPv6 IPoEサービス（IPv4 over IPv6）をご利用になれません。また、IPv4 PPPoEと IPv4 over IPv6との重畳接続は不可です。\n※DS-Lite(動的IP)契約の場合、外部からお客様環境内のパソコンやNW機器にアクセスはできません。\n※ひかりクラウドPBXは本サービス適用外です。",null,null,null,null,null,null,null,"HMAC-SHA384","3DES-CBC"]
[null,"岐阜県",null,"ハイエンドタイプ_7年月額支払い型",4500,3,null,null,null,null,null,null,null,"廃止(オプション)",null,null,null,null,null,null,null,null,null,null,null,null,"■　\nv6コネクト","v6コネクト IPv6 IPoEサービス（IPv4 over IPv6）接続の利用","v6コネクト IPv6 IPoEサービス（IPv4 over IPv6）接続の設定を行います。\n・本サービスの利用には、別途、契約が必要です。必要な契約については、「【参照】IPv6契約・アクセス回線」シートに記しておりますので、そちらをご覧ください。\n・本サービスを利用可能な回線については、「【参照】IPv6契約・アクセス回線」シートに記しておりますので、そちらをご覧ください。\n・本サービスにより、提供できる／できない機能については、「【参照】提供可能なサービス」シートに記しておりますので、そちらをご覧下さい。\n・本サービスをご利用の場合、訪問保守オプションは「インターネット直収されていないルーター」の作業内容となります。(夜間対応不可となります)\n※IPv4 PPPoEによるインターネット接続につきましては、「 2. プロバイダー（ISP）の利用」が対象です。\n※プロバイダー（ISP）をご利用の場合には、v6コネクトの IPv6 IPoEサービス（IPv4 over IPv6）をご利用になれません。また、IPv4 PPPoEと IPv4 over IPv6との重畳接続は不可です。\n※DS-Lite(動的IP)契約の場合、外部からお客様環境内のパソコンやNW機器にアクセスはできません。\n※ひかりクラウドPBXは本サービス適用外です。\n※v6コネクト(ASAHIネットのみ)はDS-Lite(動的IP)にのみ対応しています。固定IPには対応していません。",null,null,null,null,null,null,null,"HMAC-SHA512","DES-CBC"]
[null,"静岡県",null,"ベーシックタイプ_お買上げ型",3500,4,null,null,null,null,null,null,null,null,null,null,null,null,null,null,null,null,null,null,null,null,null,"andilne IPv6 IPoEサービス（IPv4 over Ipv6）の利用",null,null,null,null,null,null,null,null,"HMAC-MD5"]
[null,"愛知県",null,"ハイエンドタイプ_お買上げ型",3500,5,null,null,null,null,null,null,null,null,null,null,null,null,null,null,null,null,null,null,null,null,null,"@nifty IPv6 IPoEサービス（IPv4 over Ipv6）の利用"]
[null,"三重県",null,null,null,6,null,null,null,null,null,null,null,null,null,null,null,null,null,null,null,null,null,null,null,null,null,"WAKWAK IPv6 IPoEサービス（IPv4 over Ipv6）の利用",null,null,null,null,null,null,null,null,"HMAC-SHA"]
[null,"滋賀県",null,null,null,7,null,null,null,null,null,null,null,null,null,null,null,null,null,null,null,null,null,null,null,null,null,"BIGLOBE IPv6 IPoEサービス（IPv4 over Ipv6）の利用",null,null,null,null,null,null,null,null,"HMAC-SHA256"]
[null,"京都府",null,null,null,8,null,null,null,null,null,null,null,null,null,null,null,null,null,null,null,null,null,null,null,null,null,"So-net IPv6 IPoEサービス（IPv4 over Ipv6）の利用",null,null,null,null,null,null,null,null,"HMAC-MD5"]
[null,"大阪府",null,null,null,9]
[null,"兵庫県",null,null,null,10]
[null,"奈良県",null,null,null,11]
[null,"和歌山県",null,null,null,12]
[null,"鳥取県",null,null,null,13]
[null,"島根県",null,null,null,14]
[null,"岡山県",null,null,null,15]
[null,"広島県",null,null,null,16]
[null,"山口県",null,null,null,17]
[null,"徳島県",null,null,null,18]
[null,"香川県",null,null,null,19]
[null,"愛媛県",null,null,null,20]
[null,"高知県"]
[null,"福岡県"]
[null,"佐賀県"]
[null,"長崎県"]
[null,"熊本県"]
[null,"大分県"]
[null,"宮崎県"]
[null,"鹿児島県"]
[null,"沖縄県"]

{"sheet":"設定値リスト","index":2,"n_rows":26,"n_cols":4,"rows_kept":26,"cut":false,"hidden":true,"merged":[]}
[]
[0.99999999999998901,"隔離","終了","フルアクセス権限"]
["01:00:00","ログのみ","ログのみ","デバイスの内容のみリスト表示"]
["02:00:00",null,null,"読み取り"]
["03:00:00",null,null,"変更"]
["04:00:00",null,null,"読み取りおよび実行"]
["05:00:00"]
["06:00:00"]
["07:00:00"]
["08:00:00"]
["09:00:00"]
["10:00:00"]
["11:00:00"]
["12:00:00"]
["13:00:00"]
["14:00:00"]
["15:00:00"]
["16:00:00"]
["17:00:00"]
["18:00:00"]
["19:00:00"]
["20:00:00"]
["21:00:00"]
["22:00:00"]
["23:00:00"]
["24:00"]

{"sheet":"FastHelp_顧客","index":3,"n_rows":1,"n_cols":14,"rows_kept":1,"cut":false,"hidden":true,"merged":[]}
["顧客番号","運営元名","顧客登録番号","姓","名","姓カナ","名カナ","電話番号1","メールアドレス1","郵便番号","都道府県","住所1","アクセスライン","契約登録番号"]

{"sheet":"FastHelp_契約","index":4,"n_rows":2,"n_cols":36,"rows_kept":2,"cut":false,"hidden":true,"merged":[]}
["契約登録番号","契約名","申込み日","基本メニュー","基本メニュー_利用開始日","ゲートウェイ1","ゲートウェイ1_台数（台）","ゲートウェイ1_利用開始日","ゲートウェイ2","ゲートウェイ2_台数（台）","ゲートウェイ2_利用開始日","VPN構成","エンドポイントセキュリティ_ライセンス数","エンドポイントセキュリティ_利用開始日","記事欄","＜契約者情報＞","法人・企業名","契約者郵便番号","契約者住所","＜申込者情報＞","部署名","氏名","氏名カナ","電話番号","＜連絡先情報（管理者情報）＞","部署名","氏名","氏名カナ","電話番号","管理者メールアドレス(正)","管理者メールアドレス(副)","＜事業者連絡先＞","部署名","氏名","氏名カナ","電話番号"]
[{"$f":"#REF!","v":{"$error":"#REF!"}},{"$f":"\"セキュおまOEM_\"&A2&\"_\"&#REF!","v":{"$error":"#REF!"}},{"$f":"#REF!&\"/\"&#REF!&\"/\"&#REF!","v":{"$error":"#REF!"}},{"$f":"#REF!","v":{"$error":"#REF!"}},{"$f":"#REF!&\"/\"&#REF!&\"/\"&#REF!","v":{"$error":"#REF!"}},{"$f":"IF(#REF!=\"\",\"\",#REF!)","v":{"$error":"#REF!"}},{"$f":"IF(#REF!=\"\",\"\",#REF!)","v":{"$error":"#REF!"}},{"$f":"IF(#REF!=\"\",\"\",#REF!&\"/\"&#REF!&\"/\"&#REF!)","v":{"$error":"#REF!"}},{"$f":"IF(#REF!=\"\",\"\",#REF!)","v":{"$error":"#REF!"}},{"$f":"IF(#REF!=\"\",\"\",#REF!)","v":{"$error":"#REF!"}},{"$f":"IF(#REF!=\"\",\"\",#REF!&\"/\"&#REF!&\"/\"&#REF!)","v":{"$error":"#REF!"}},{"$f":"IF(#REF!=\"\",\"\",#REF!)","v":{"$error":"#REF!"}},{"$f":"IF(#REF!=\"\",\"\",#REF!)","v":{"$error":"#REF!"}},{"$f":"IF(#REF!=\"\",\"\",#REF!&\"/\"&#REF!&\"/\"&#REF!)","v":{"$error":"#REF!"}},{"$f":"IF(#REF!=\"\",\"\",#REF!)","v":{"$error":"#REF!"}},null,{"$f":"#REF!","v":{"$error":"#REF!"}},{"$f":"#REF!&#REF!&#REF!","v":{"$error":"#REF!"}},{"$f":"#REF!&#REF!&#REF!","v":{"$error":"#REF!"}},null,{"$f":"IF(#REF!=\"\",\"\",#REF!)","v":{"$error":"#REF!"}},{"$f":"IF(#REF!=\"\",\"\",#REF!&\" \"&#REF!)","v":{"$error":"#REF!"}},{"$f":"IF(#REF!=\"\",\"\",#REF!&\" \"&#REF!)","v":{"$error":"#REF!"}},{"$f":"IF(#REF!=\"\",\"\",#REF!&#REF!&#REF!&#REF!&#REF!)","v":{"$error":"#REF!"}},null,{"$f":"IF(#REF!=\"申込者情報と同じ\",IF(#REF!=\"\",\"\",#REF!),IF(#REF!=\"申込者情報と異なる\",IF(#REF!=\"\",\"\",#REF!),\"\"))","v":{"$error":"#REF!"}},{"$f":"IF(#REF!=\"申込者情報と同じ\",IF(#REF!=\"\",\"\",#REF!&\" \"&#REF!),IF(#REF!=\"申込者情報と異なる\",IF(#REF!=\"\",\"\",#REF!&\" \"&#REF!),\"\"))","v":{"$error":"#REF!"}},{"$f":"IF(#REF!=\"申込者情報と同じ\",IF(#REF!=\"\",\"\",#REF!&\" \"&#REF!),IF(#REF!=\"申込者情報と異なる\",IF(#REF!=\"\",\"\",#REF!&\" \"&#REF!),\"\"))","v":{"$error":"#REF!"}},{"$f":"IF(#REF!=\"申込者情報と同じ\",IF(#REF!=\"\",\"\",#REF!&#REF!&#REF!&#REF!&#REF!),IF(#REF!=\"申込者情報と異なる\",IF(#REF!=\"\",\"\",#REF!&#REF!&#REF!&#REF!&#REF!),\"\"))","v":{"$error":"#REF!"}},{"$f":"IF(#REF!=\"\",\"\",#REF!)","v":{"$error":"#REF!"}},{"$f":"IF(#REF!=\"\",\"\",#REF!)","v":{"$error":"#REF!"}}]

{"sheet":"【参照】IPv4 IPv6 提供機能比較表","index":5,"n_rows":34,"n_cols":13,"rows_kept":34,"cut":false,"hidden":false,"merged":[[1,1,2,12],[3,1,6,3],[3,4,3,7],[3,8,3,11],[4,4,4,5],[4,6,4,7],[4,8,4,9],[4,10,4,11],[4,12,6,12],[5,4,5,5],[5,6,5,7],[5,8,5,9],[5,10,5,11],[25,12,26,12],[7,12,8,12],[9,2,10,2],[9,12,10,12],[11,2,12,2],[11,12,12,12],[33,8,34,8],[7,1,34,1],[7,2,8,2],[13,2,14,2],[13,12,14,12],[15,2,16,2],[15,12,16,12],[17,2,18,2],[17,12,18,12],[19,2,20,2],[19,12,20,12],[21,2,22,2],[21,12,22,12],[23,2,24,2],[23,12,24,12],[25,2,26,2],[33,9,34,9],[27,2,28,2],[27,12,28,12],[29,2,30,2],[29,12,30,12],[33,10,34,10],[33,11,34,11],[33,12,34,12],[31,2,32,2],[31,12,32,12],[33,2,34,2],[33,3,34,3],[33,4,34,4],[33,5,34,5],[33,6,34,6],[33,7,34,7]]}
[]
[null,"IPv4-PPPoEかIPv6-IPoEいずれかを選択したときの提供可能な主な機能  "]
[]
[null,null,null,null,"フレッツ光 ネクスト契約",null,null,null,"フレッツ光 クロス契約",null,null,null,"備考"]
[null,null,null,null,"IPｖ4 PPPoE",null,"IPv6 IPoE",null,"IPｖ4 PPPoE",null,"IPv6 IPoE",null,"※「IPv6 IPoE」表記は「IPv4 over IPv6」を表しています。\n※IPv6-IPoEで利用可能なサービスは「【参照】IPv6契約・アクセス回線」シートをご参照ください。\n※IPv4-PPPoE と IPv6-IPoE とでは、いずれか一方しか、ご利用になれません。\n※IPv4-PPPoEとIPv6-IPoEとの重畳接続は「不可」です。"]
[null,null,null,null,"WAN側アドレス",null,"WAN側アドレス",null,"WAN側アドレス",null,"WAN側アドレス"]
[null,null,null,null,"固定IP","動的IP","固定IP","動的IP","固定IP","動的IP","固定IP","動的IP"]
[null,"機能","固定LAN側アドレス","IPv4値","〇","〇","〇","〇","×","×","〇","〇","ローカル（プライベート）のIPアドレスの固定値（範囲）を手動で、設定します。なお、基本的には、LAN側のIPv6アドレスは自動設定されます。"]
[null,null,null,"IPv6値","―","―","×","×","―","―","×","×"]
[null,null,"静的ルーティング","IPv4値","〇","〇","〇","〇","×","×","〇","〇","デフォルト経路や特定の宛先ネットワークへのゲートウェイを設定します。\n"]
[null,null,null,"IPv6値","―","―","×","×","―","―","×","×"]
[null,null,"静的NAT","IPv4値","〇","×","×","×","×","×","×","×","複数のグローバルアドレスがある場合、そのうちの特定のグローバルアドレスと特定のローカル（プライベート）アドレスとを１対１に紐づけるよう、設定します。"]
[null,null,null,"IPv6値","―","―","×","×","―","―","×","×"]
[null,null,"静的IPマスカレード","IPv4値","〇","×　※","〇","×","×","×","〇","×","WAN側からの特定のプロトコル・ポートの通信をLAN側の特定の機器（ローカル（プライベート）アドレス）が受けるよう、設定します。※ネットボランチDNSを利用する場合、〇。"]
[null,null,null,"IPv6値","―","―","×","×","×","×","×","×"]
[null,null,"静的IPフィルター","IPv4値","〇","〇","〇","〇","×","×","〇","〇","WAN側とLAN側との通信につき、IPアドレスやプロトコル、ポートを指定し、通過／遮断するよう、設定します。IPv6値の設定では、OCN-VCS経由のIPv4通信ができなくなるおそれがありますので、十分にご注意ください。"]
[null,null,null,"IPv6値","―","―","〇","〇","―","―","〇","〇"]
[null,null,"固定中継先DNSサーバー","IPv4値","〇","〇","〇","〇","×","×","〇","〇","オープンDNSやISP、VNEとしてのOCNから提示されるDNSサーバー、クラウドなどの外部のネットワークに置くDNSサーバーの固定のアドレスを手動で、設定します。"]
[null,null,null,"IPv6値","―","―","〇","〇","―","―","〇","〇"]
[null,null,"拠点間接続","IPv4値","〇","×　※","〇","×","×","×","〇","×","固定のグローバルアドレスを用いて本社と支店と工場（例）のルーター間を内部ネットワークとして通信するよう、設定します。※ネットボランチDNSを利用する場合、〇。"]
[null,null,null,"IPv6値","―","―","〇","×","―","―","〇","×"]
[null,null,"リモートアクセス","IPv4値","〇","×　※","〇","×","×","×","〇","×","WAN側（インターネットなど）のPCやモバイル端末と事務所（例）のルーターとの間を内部ネットワークとして通信するよう、設定します。※ネットボランチDNSを利用する場合、〇。"]
[null,null,null,"IPv6値","―","―","×","×","―","―","×","×"]
[null,null,"ネットボランチDNS","IPv4値","〇","〇","×","×","×","×","×","×","動的なグローバルアドレスである場合に拠点間接続やリモートアクセス、DMZ公開サーバー・カメラを利用するために設定します。"]
[null,null,null,"IPv6値","―","―","×","×","―","―","×","×"]
[null,null,"フレッツVPNワイド","IPv4値","〇","〇","×","×","×","×","×","×","インターネットを経由せず、フレッツ網を利用した拠点間接続を設定します。\n"]
[null,null,null,"IPv6値","―","―","×","×","―","―","×","×"]
[null,null,"DMZ公開サーバー・カメラ","IPv4値","〇","×　※","〇","×","×","×","〇","×","LAN側の監視カメラや公開WEBサーバーへのWAN側からのRTSP/554やHTTPS/443の通信をそれらの機器が受けるよう、設定します。※ネットボランチDNSを利用する場合、〇。"]
[null,null,null,"IPv6値","―","―","×","×","―","―","×","×"]
[null,null,"タグVLAN","IPv4値","〇","〇","〇","〇","×","×","〇","〇","LAN側のインターフェースを複数のVLANが利用できるよう、設定します。\n"]
[null,null,null,"IPv6値","―","―","―","―","―","―","―","―"]
[null,null,"スイッチ・オプション","IPv4値","〇","〇","〇","〇","×","×","〇","〇","LAN側にスイッチ（ベーシック、ハイエンド）を接続するよう、設定します。\n"]
[null,null,null,"IPv6値","―","―","―","―","―","―","―","―"]
[null,null,"PPPoEパススルー","―","〇","〇","×","×","×","×","×","×","ルーターにおいてNATをせず、LAN側のPCから直にWAN側のPPPoEサーバーへ接続するよう、設定します。"]

{"sheet":"【参照】IPv6契約・アクセス回線","index":6,"n_rows":87,"n_cols":9,"rows_kept":87,"cut":false,"hidden":false,"merged":[[2,1,3,8],[4,8,5,8],[6,4,9,4],[6,8,7,8],[8,8,9,8],[4,1,5,2],[4,3,5,3],[4,4,5,4],[4,5,5,5],[4,6,5,6],[4,7,5,7],[6,1,9,2],[6,3,9,3],[6,5,7,5],[6,6,7,6],[6,7,7,7],[8,5,9,5],[8,6,9,6],[8,7,9,7],[16,7,17,7],[10,1,13,2],[10,3,13,3],[10,5,11,5],[10,6,11,6],[10,7,11,7],[12,5,13,5],[12,6,13,6],[12,7,13,7],[10,4,13,4],[28,1,31,2],[28,3,31,3],[28,5,29,5],[28,6,29,6],[28,7,29,7],[30,5,31,5],[30,6,31,6],[30,7,31,7],[26,1,27,2],[26,3,27,3],[26,4,27,4],[26,5,27,5],[26,6,27,6],[26,7,27,7],[36,1,39,2],[36,3,39,3],[36,5,37,5],[36,6,37,6],[36,7,37,7],[38,5,39,5],[38,6,39,6],[38,7,39,7],[32,1,35,2],[32,3,35,3],[32,5,33,5],[32,6,33,6],[32,7,33,7],[34,5,35,5],[34,6,35,6],[34,7,35,7],[65,1,66,4],[67,2,73,2],[67,3,69,3],[70,3,72,3],[73,3,73,4],[49,1,50,4],[40,1,43,2],[40,3,43,3],[40,5,41,5],[40,4,43,4],[42,5,43,5],[84,2,86,2],[84,3,84,4],[86,3,86,4],[74,2,79,2],[74,3,76,3],[77,3,79,3],[80,2,83,2],[80,3,81,3],[82,3,83,3],[10,8,11,8],[12,8,13,8],[14,4,17,4],[14,8,15,8],[16,8,17,8],[18,4,21,4],[18,8,19,8],[20,8,21,8],[24,1,25,8],[18,1,21,2],[18,3,21,3],[18,5,19,5],[18,6,19,6],[18,7,19,7],[20,5,21,5],[20,6,21,6],[20,7,21,7],[14,1,17,2],[14,3,17,3],[14,5,15,5],[14,6,15,6],[14,7,15,7],[16,5,17,5],[16,6,17,6],[26,8,27,8],[28,4,31,4],[28,8,29,8],[30,8,31,8],[32,4,35,4],[32,8,33,8],[34,8,35,8],[36,4,39,4],[36,8,37,8],[38,8,39,8],[40,8,41,8],[42,8,43,8],[46,1,46,7],[47,1,47,5],[51,2,54,3],[55,2,56,3],[57,2,58,3],[59,2,60,3],[63,1,63,5],[61,1,61,4],[40,6,41,6],[40,7,41,7],[42,6,43,6],[42,7,43,7]]}
[]
[]
[null,"IPv6_IPoEサービス(フレッツ光ネクスト)の対応機種および対応ファームのバージョン一覧"]
[]
[null,"ISP提供会社",null,"サービス名称","高速通信方式(IPv4 over IPv6)","IP払出し方式","RTX1300\n(ハイエンド10GタイプY)","RTX1210/1220\n(ハイエンドY)","RTX830\n(ベーシックY)"]
[]
[null,"OCN",null,"ＯＣＮ　光「フレッツ」　ＩＰｏＥ　標準プラン","OCNバーチャルコネクト\t","動的","〇\nRev.23.00.13 以降","〇\nRev.14.01.36 以降","〇\nRev.15.02.15 以降"]
[]
[null,null,null,null,null,"固定","〇\nRev.23.00.13 以降","○\nRev.14.01.36 以降","○\nRev.15.02.15 以降"]
[]
[null,"OCN",null,"ＯＣＮ　光「フレッツ」　ＩＰｏＥ　ワイドプラン　","OCNバーチャルコネクト\t","動的","〇\nRev.23.00.05 以降","〇\nRev.14.01.36 以降","〇\nRev.15.02.15 以降"]
[]
[null,null,null,null,null,"固定","〇\nRev.23.00.05 以降","○\nRev.14.01.36 以降","○\nRev.15.02.15 以降"]
[]
[null,"NTTメディアサプライ",null,"BizConecta","transix","動的","〇\nRev.23.00.13 以降","〇\nRTX1210:Rev.14.01.42以降\nRTX1220：Rev.15.04.05 以降","〇\nRev.15.02.28 以降"]
[]
[null,null,null,null,null,"固定","〇\nRev.23.00.13 以降","〇\nRTX1210:Rev.14.01.42以降\nRTX1220：Rev.15.04.05 以降","○\nRev.15.02.28 以降"]
[]
[null,"ASAHIネット",null,"v6コネクト","v6コネクト","動的","〇\nRev.23.00.13 以降","〇\nRTX1210:Rev.14.01.42以降\nRTX1220：Rev.15.04.05 以降","○\nRev.15.02.30 以降"]
[]
[null,null,null,null,null,"固定","×","×","×"]
[]
[null,"※HGWのフレッツジョイント機能をご利用の場合は現地作業でHGWの「IPoE IPv4設定」を無効にする必要があります。",null,null,null,null,null,null,"2025年2月3日時点"]
[]
[null,"IPv6_IPoEサービス(フレッツ光クロス)の対応機種および対応ファームのバージョン一覧"]
[]
[null,"ISP提供会社",null,"サービス名称","高速通信方式(IPv4 over IPv6)","IP払出し方式","RTX1300\n(ハイエンド10GタイプY)","RTX1210/1220\n(ハイエンドY)","RTX830\n(ベーシックY)"]
[]
[null,"OCN",null,"ＯＣＮ　光「フレッツ」　ＩＰｏＥ　クロス　標準プラン","OCNバーチャルコネクト\t","動的","○\nRev.23.00.05 以降","×","×"]
[]
[null,null,null,null,null,"固定","○\nRev.23.00.05 以降","×","×"]
[]
[null,"OCN",null,"ＯＣＮ　光「フレッツ」　ＩＰｏＥ　クロス　ワイドプラン","OCNバーチャルコネクト\t","動的","○\nRev.23.00.05 以降","×","×"]
[]
[null,null,null,null,null,"固定","〇\nRev.23.00.05 以降","〇\nRev.15.04.07 以降","〇\nRev.15.02.31 以降"]
[]
[null,"NTTメディアサプライ",null,"BizConecta(モア)","transix","動的","×","×","×"]
[]
[null,null,null,null,null,"固定","〇\nRev.23.00.14 以降","〇\nRTX1210:Rev.14.01.42以降\nRTX1220：Rev.15.04.07 以降","〇\nRev.15.02.31 以降"]
[]
[null,"ASAHIネット",null,"v6コネクト","v6コネクト","動的","〇\nRev.23.00.13 以降","〇\nRev.15.04.07 以降","〇\nRev.15.02.31 以降"]
[]
[null,null,null,null,null,"固定","×","×","×"]
[]
[null,null,null,null,null,null,null,null,"2025年2月3日時点"]
[]
[null,"①【ルーター】機能選択シートの「 5. IPv6 IPoEサービス（IPv4 over IPv6）の利用」で選択できる"]
[null,"利用可能（〇）なIPv6_IPoEサービスの「契約」は以下のとおりです。"]
[]
[null,"IPv6_IPoEサービスを利用可能な契約"]
[]
[null,"〇","ＯＣＮ　光「フレッツ」　ＩＰｏＥ　標準プラン/\nＯＣＮ　光「フレッツ」　ＩＰｏＥ　ワイドプラン/\nＯＣＮ　光「フレッツ」　ＩＰｏＥ　クロス　標準プラン/\nＯＣＮ　光「フレッツ」　ＩＰｏＥ　クロス　ワイドプラン",null,"シェアードアドレス契約（動的IP）"]
[null,"〇",null,null,"固定 IP 1 契約"]
[null,"×",null,null,"固定 IP 8 契約"]
[null,"×",null,null,"固定 IP16 契約"]
[null,"〇","BizConecta",null,"DS-Lite 契約（動的IP）"]
[null,"〇",null,null,"固定 IP 契約"]
[null,"×","BizConecta(モア)",null,"DS-Lite 契約（動的IP）"]
[null,"〇",null,null,"IPIP 契約 (固定IP)"]
[null,"〇","v6コネクト",null,"DS-Lite 契約（動的IP）"]
[null,"×",null,null,"IPIP 契約 (固定IP)"]
[]
[]
[null,"IPv6_IPoEサービスを利用可能（〇）な「アクセス回線」は以下のとおりです。"]
[null,"※上記の「IPv6_IPoEサービスの対応機種および対応ファームのバージョン一覧」をご参照ください。"]
[null,"IPv6_IPoEサービスを利用可能な　アクセス回線",null,null,null,"参考：（光コラボ型）における相当のフレッツメニュー"]
[]
[null,"〇","フレッツ光ネクスト","マンション","フレッツ光ネクスト・ハイスピード"]
[null,"〇",null,null,"フレッツ光ネクスト・スーパー・ハイスピード隼"]
[null,"〇",null,null,"フレッツ光・ライト"]
[null,"〇",null,"ファミリー","フレッツ光ネクスト・ハイスピード"]
[null,"〇",null,null,"フレッツ光ネクスト・スーパー・ハイスピード隼"]
[null,"〇",null,null,"フレッツ光・ライト"]
[null,"〇",null,"フレッツ光ネクスト・ビジネス"]
[null,"〇","フレッツ光ネクスト\n（光コラボ型）","マンション","100Mbps","フレッツ光ネクスト"]
[null,"〇",null,null,"200Mbps","フレッツ光ネクスト・ハイスピード"]
[null,"〇",null,null,"１Gbps","フレッツ光ネクスト・スーパー・ハイスピード隼"]
[null,"〇",null,"ファミリー","100Mbps","フレッツ光ネクスト"]
[null,"〇",null,null,"200Mbps","フレッツ光ネクスト・ハイスピード"]
[null,"〇",null,null,"１Gbps","フレッツ光ネクスト・スーパー・ハイスピード隼"]
[null,"〇","フレッツ光クロス","マンション","フレッツ光クロス　マンションタイプ"]
[null,"〇",null,null,"フレッツ光クロス　オフィスタイプ（マンション）"]
[null,"〇",null,"ファミリー","フレッツ光クロス　ファミリータイプ"]
[null,"〇",null,null,"フレッツ光クロス　オフィスタイプ（ファミリー）"]
[null,"×","フレッツ光クロス\n（光コラボ型）",null,null,"マンション　フレッツ光・ライト"]
[null,"×",null,null,null,"ファミリー　フレッツ光・ライト"]
[null,"×",null,null,null,"フレッツ光ネクスト・ビジネス"]

{"sheet":"現場設定変更","index":7,"n_rows":46,"n_cols":8,"rows_kept":46,"cut":false,"hidden":false,"merged":[[4,1,11,1],[12,1,19,1],[1,0,1,12],[4,2,11,6],[12,2,19,6],[3,2,3,6],[3,7,3,11],[4,7,11,11],[12,7,19,11]]}
[]
["【ルータ-】現場(営業)での設定変更箇所記載シート"]
[]
[null,"設定方法","お客様の要件",null,null,null,null,"設定内容"]
[null,"GUI"]
[]
[]
[]
[]
[]
[]
[]
[null,"CLI"]
[]
[]
[]
[]
[]
[]
[]
[]
[null,"※注意事項"]
[null,"【下記のことが実施されたら、YNOサーバーで管理ができなくなってしまいます】"]
[null,"・YNOエージェントの設定を消す。"]
[null,"【下記のコマンドは削除しないでください】"]
[null,"　description yno ・・・・・・"]
[null,"　yno use on"]
[null,"　yno access code ・・・・・・・"]
[null,"　switch control use lan1 on terminal=on"]
[null,"・L2MSスレーブ機がある場合、RTX1220/RTX830でのL2MS設定がなされていない。"]
[null,"・L2MSフレームの送受信が発生するインタフェース(lan1)でポートVLANの設定がなされている。"]
[null,"・SWX2310-28GT/SWX2110-8GでL2MSスレーブ設定になされていない。 "]
[null,"・EthernetフィルタやIPフィルタ機能にてRTX1220/RTX830/SWX2310-28GT/SWX2110-8G"]
[null,"　間で通信不可となる設定がなされている。"]
[null,"・ルーティング、NATやフィルタ機能にてYNOサーバ(下記サイト)へ通信不可となる設定がなされている。"]
[null,"【下記のドメインへ下記のポート番号が通信可能であり続ける必要があります】"]
[null,"　yno-agent.netvolante.jp:443"]
[null,"　yno-xmpp.netvolante.jp:443"]
[null,"　yno-xmpp-px.netvolante.jp:443"]
[null,"　yno-gfw.netvolante.jp:443"]
[null,"　www.rtpro.yamaha.co.jp:80"]
[null,"　yno.netvolante.jp:443"]
[null,"【下記のことを実施された場合、セキュリティリスクを伴う可能性があります】"]
[null,"セキュリティに関する留意点"]
[null,"・類推されるパスワードの設定およびパスワードの使い回しはしないこと"]
[null,"・ファイル共有のポート開放等といったセキュリティリスクになる設定はしないこと"]

{"sheet":"①【ルーター】機能選択シート","index":8,"n_rows":45,"n_cols":11,"rows_kept":45,"cut":false,"hidden":false,"merged":[[44,2,44,4],[29,4,29,8],[33,1,35,1],[33,2,35,2],[33,3,35,3],[35,4,35,10],[30,9,30,10],[33,9,33,10],[30,4,30,8],[32,4,32,8],[31,4,31,8],[32,9,32,10],[31,9,31,10],[34,6,34,10],[33,6,33,8],[28,9,28,10],[1,1,1,10],[28,4,28,8],[14,1,14,10],[29,9,29,10],[17,4,17,8],[16,4,16,8],[18,4,18,8],[19,4,19,8],[20,4,20,8],[22,4,22,8],[26,4,26,8],[27,4,27,8],[3,5,3,6],[3,1,3,3],[8,7,8,8],[9,7,9,8],[8,4,9,5],[8,9,8,10],[9,9,9,10],[18,9,18,10],[8,6,9,6],[4,4,4,10],[5,4,5,10],[6,4,6,10],[7,1,7,10],[4,1,4,3],[8,2,9,3],[10,4,10,5],[6,1,6,3],[5,1,5,3],[8,1,9,1],[20,9,20,10],[21,9,21,10],[10,1,10,3],[26,9,26,10],[27,9,27,10],[22,9,22,10],[23,9,23,10],[24,9,24,10],[25,9,25,10],[23,4,23,8],[24,4,24,8],[25,4,25,8],[21,4,21,8],[17,9,17,10],[19,9,19,10]]}
[]
[null,"【ルータ-】機能選択シート "]
[]
[null,"お申し込み日",null,null,null,"年",null,null,"月",null,"日"]
[null,"ご契約者名※1"]
[null,"ご担当者様名※1"]
[null,"ご連絡先電話番号※1"]
[null,"設定変更対象の機器情報（下記①もしくは②をご記入ください）※1"]
[null,"①","ご契約ID",null,null,null,"②","クラウド管理サーバーログインID"]
[null,null,null,null,null,null,null,"シリアルNo"]
[null,"申し込み区分　※1,2"]
[null,null,null,null,"※1は記入必須事項になります。当申込書の受領確認及び、記載内容に関してのご担当者様とご連絡先電話番号をご記入ください。"]
[null,null,null,null,"※2にて設定の追加・削除・変更を選択ください。"]
[null,"１．【ルーター】機能選択シート"]
[null,"※本シートでは、予めデフォルトで利用有効に設定している機能があります。また、各種設定シートにおいても予めデフォルト設定している項目があります。それら設定がお客様ご運用において正しいかを必ずご確認の上、各種設定シートを作成してください。なお、本シートに記載できない内容はサービス提供範囲外となります。"]
[]
[null,"№","機能一覧","利用有無","備考",null,null,null,null,"「有」の場合に記入が必要なシート"]
[null,{"$f":"ROW()-17","v":1},"システムの設定","□","LANアドレスやDHCP、管理パスワードなど、システム共通の設定を行います。LANアドレスやDHCP、管理パスワード、ネットボランチDNSなど、システム共通の設定を行います。\n※ネットボランチDNSについては、キッティング作業にて事前に作業することができません。そのため、現地での開通後に別途、変更申込書にてサポートセンタにご依頼いただくことが必要です。\n※ネットボランチDNSのご利用にあたっては、メーカーの下記の利用規約に同意いただくことが必要です。\nhttp://www.rtpro.yamaha.co.jp/RT/FAQ/NetVolanteDNS/index.html\n※ネットボランチDNSをご利用のユーザー様において機器が故障した場合には、機器の交換後に同一のFQDNを利用することができないおそれがありますので、故障交換後には、新たにホスト名を設定しなおす必要がある可能性があります。\n※「5.IPv6 IPoEサービス（IPv4 over Ipv6）」をご利用の場合には、ネットボランチDNSをご利用になれません。",null,null,null,null,"②【ルーター】システム設定"]
[null,{"$f":"ROW()-17","v":2},"プロバイダー（ISP）の利用","□","インターネットに接続する設定を行います。\n・本機能の利用には、別途プロバイダをお客様にてご契約いただく必要があります。\nIPv4 PPPoEと IPv4 over IPv6との重畳接続は不可です。\n※光クロスおよびIPoEサービスをご利用の場合はNo.5を選択してください。",null,null,null,null,"③【ルーター】回線プロバイダ設定"]
[null,3,"フレッツ光のセキュリティ対策ツール・リモートサポートツール等の利用","□","・現時点において利用されなくとも、将来的にセキュリティ対策ツール・リモートサポートツール等をご利用になる可能性がある場合には、”■(利用する)”を選択してください。\n・遠隔からの設定変更が将来的に可能なようにダミーでIPv6設定をキッティング時に実施いたします。\n※本設定を実施しない場合、セキュリティ対策ツールなどのIPv6通信が必要なサービスをご利用いただく事ができません。\n※タグVLANかつスイッチオプション構成において、スイッチオプション配下の <デフォルトVLAN以外を設定したアクセスポート> ではセキュリティ対策ツールは使用できません。(IPv6の仕様上、/64より細かいサブネットの分割できないため)。セキュリティ対策ツールを使用する場合はルータのLANポートもしくは <デフォルトVLANを設定したアクセスポート> に接続ください。",null,null,null,null,"③【ルーター】回線プロバイダ設定"]
[null,4,"フレッツVPNワイドの利用","□","フレッツVPNワイドに接続する設定を行います。\n・本サービスをご利用の場合、訪問保守オプションは「インターネット直収されていないルータ」の作業内容となります。(夜間対応不可となります)\n※「5.IPv6 IPoEサービス（IPv4 over Ipv6）」をご利用の場合には、フレッツVPNワイドをご利用になれません。",null,null,null,null,"③【ルーター】回線プロバイダ設定"]
[null,5,{"$f":"_xlfn.XLOOKUP(D22,データシート!AA3:AA6,データシート!AB3:AB6)","v":"IPv6 IPoEサービス（IPv4 over IPv6）の利用"},"□",{"$f":"_xlfn.XLOOKUP(C22,データシート!AB3:AB6,データシート!AC3:AC6)&\"\"","v":"IPv6 IPoEサービス（IPv4 over IPv6）の種類\n\n・OCN光：OCN光 IPv6 IPoEサービス（IPv4 over IPv6）の利用\n・BizConecta：BizConecta IPv6 IPoEサービス（IPv4 over Ipv6）の利用\n・v6コネクト：v6コネクト IPv6 IPoEサービス（IPv4 over Ipv6）の利用"},null,null,null,null,"③【ルーター】回線プロバイダ設定"]
[null,6,"タグVLANの利用","□","LANインタフェースでタグVLANを利用する場合の設定を行います。",null,null,null,null,"④【ルーター】タグVLAN設定"]
[null,7,"フレッツVPNワイド利用時の\n拠点間VPN(IPSecトンネル)の利用","□","フレッツVPNワイド利用時に、本社ルータと拠点ルータ間でVPN(IPSecトンネル）を接続する際の設定を行います。\n※フレッツVPNワイドでの拠点間接続はIPSecのみがサービス提供範囲内となります。\n※「5.IPv6 IPoEサービス（IPv4 over Ipv6）」をご利用の場合には、フレッツVPNワイドをご利用になれません。",null,null,null,null,"⑤【ルーター】拠点間IPSec接続先"]
[null,8,"インターネットVPN(拠点間接続)の利用","□","本社ルータと拠点ルータ間でインターネットVPN（IPSecトンネル）を接続する設定を行います。\n※各機能のトンネルの設定最大数は、ハイエンドタイプYでは100、ベーシックタイプYでは20です。\n※ハブ アンド スポーク構成のみをサポートしています。",null,null,null,null,"⑤【ルーター】拠点間IPSec接続先"]
[null,9,"外出先等からのリモートアクセスの利用","□","Windows端末やスマート端末を利用してルータにリモート接続する設定を行います。\n・Windows端末での利用には、別途、YMS-VPN8ソフトウェアライセンス版をお持ちであることが必要です。\n・なお、YMS-VPN8-CP(同時接続ライセンス）版については、サポートしていません。\n・ネットボランチDNSを用いてのリモートアクセスもご利用いただけますが、下記の事項にご留意ください。\n※ネットボランチDNSについては、キッティング作業にて事前に作業することができません。そのため、現地での開通後に別途、変更申込書にてサポートセンタにご依頼いただくことが必要です。\n※ネットボランチDNSのご利用にあたっては、メーカーの下記の利用規約に同意いただくことが必要です。\nhttp://www.rtpro.yamaha.co.jp/RT/FAQ/NetVolanteDNS/index.html\n※ネットボランチDNSをご利用のユーザー様において機器が故障した場合には、機器の交換後に同一のFQDNを利用することができないおそれがありますので、故障交換後には、新たにホスト名を設定しなおす必要がある可能性があります。",null,null,null,null,"⑥【ルーター】リモートアクセス接続先"]
[null,10,"インターネット側からカメラや\n公開サーバー等へのアクセスの利用","□","インターネット側からLAN内のカメラや公開サーバなどにアクセスを可能とする場合の設定を行います。",null,null,null,null,"⑦【ルーター】カメラや公開サーバ設定"]
[null,11,"経路設定の追加","□","上記No.1-10までに設定する経路設定以外に、追加で経路設定が必要な場合に設定します。",null,null,null,null,"⑧【ルーター】経路設定"]
[null,12,"静的IPフィルタの追加","□","上記No.1-10までに設定するIPフィルタ以外に、追加で静的IPフィルタが必要な場合に設定します。",null,null,null,null,"⑨【ルーター】静的IPフィルタ設定"]
[null,13,"NATの追加","□","上記No.1-10までに設定するNAT以外に、追加で設定が必要な場合に設定します。",null,null,null,null,"⑩【ルーター】NAT設定"]
[null,14,"スイッチオプション　ハイエンドタイプY（SWX2310-28GT）の利用","□","・ルータのLANマップ機能と連携し、スイッチオプション　ハイエンドタイプYの監視・設定を可能にします。\n・スイッチオプション　ハイエンドタイプYではタグVLAN、MACアドレステーブルの設定が可能です。\nなお、スイッチオプション　ハイエンドタイプYのみのお申込みの場合は、他機能は”□(利用しない\"を選択してください。\n※6台以上の場合には、別途、バリューデザイン部まで、ご相談下さい。",null,null,null,null,"⑪【スイッチ➊➋➌➍➎】01.システム設定、\n⑫【スイッチ➊➋➌➍➎】02.タグVLAN設定、\n⑬【スイッチ➊➋➌➍➎】03.静的MACアドレステーブル"]
[null,15,"スイッチオプション　\nハイエンド10GタイプY\n（SWX2320-16MT）\nの利用","□","・ルーターのLANマップ機能と連携し、スイッチオプション　ハイエンド10GタイプYの監視・設定を可能にします。\n・スイッチオプション　ハイエンド10GタイプYではタグVLAN、MACアドレステーブルの設定が可能です。\nなお、スイッチオプション　ハイエンド10GタイプYのみのお申込みの場合は、他機能は”□(利用しない\"を選択してください。\n※6台以上の場合には、別途、バリューデザイン部まで、ご相談下さい。（アドレス：ru-ta-oma@west.ntt.co.jp）",null,null,null,null,"⑪【スイッチ➊➋➌➍➎】01.システム設定、\n⑫【スイッチ➊➋➌➍➎】02.タグVLAN設定、\n⑬【スイッチ➊➋➌➍➎】03.静的MACアドレステーブル"]
[null,{"$f":"ROW()-18","v":15},"スイッチオプション(セレクト) 　\nハイエンド10GタイプY\n（SWX2320-16MT）\nの利用","□","・ルーターのLANマップ機能と連携し、スイッチオプション　ハイエンド10GタイプYの監視・設定を可能にします。\n・スイッチオプション　ハイエンド10GタイプYではタグVLAN、MACアドレステーブルの設定が可能です。\nなお、スイッチオプション　ハイエンド10GタイプYのみのお申込みの場合は、他機能は”□(利用しない\"を選択してください。\n※6台以上の場合には、別途、バリューデザイン部まで、ご相談下さい。（アドレス：ru-ta-oma@west.ntt.co.jp）",null,null,null,null,"⑪【スイッチ➊➋➌➍➎】01.システム設定、\n⑫【スイッチ➊➋➌➍➎】02.タグVLAN設定、\n⑬【スイッチ➊➋➌➍➎】03.静的MACアドレステーブル"]
[null,{"$f":"ROW()-18","v":16},"能動連絡希望可否\n※サポートセンターからの電話連絡は即時通知を保証するものではありません。 ","□","能動連絡先部署名（会社名）",null,"能動連絡先電話番号"]
[null,null,null,null,"能動連絡先ご担当者様名"]
[null,null,null,null,"※故障疑い時にサポートセンタ―からの能動連絡を希望される方は上記をご記入ください。\n※サーバーメンテナンス期間中に故障が発生いたしました機器については、能動連絡を実施いたしません。"]
[]
[null,"２．変更内容（詳細）を記入"]
[null,"変更したい詳細内容を【ルーター】システム設定　等に記入してください。"]
[]
[null,"３．変更内容（詳細）を記入"]
[null,"設定変更の他に、NW構成の変更や機器のフロア移設等がある場合は、「ネットワーク構成図」と「ルーター設置場所」への記入もお願いします。"]
[]
[null,"※本シートを記載いただきまして、下記にメールいただきますようお願いいたします。"]
[null,null,"router_support-ml@west.ntt.co.jp"]

{"sheet":"②【ルーター】システム設定","index":9,"n_rows":87,"n_cols":34,"rows_kept":87,"cut":false,"hidden":false,"merged":[[83,1,84,8],[83,9,84,12],[85,1,85,8],[85,9,85,19],[64,16,64,17],[64,19,64,20],[64,22,64,23],[68,22,69,33],[69,15,69,21],[80,20,80,33],[81,20,82,33],[80,1,80,8],[80,9,80,19],[81,1,81,8],[81,9,81,19],[82,1,82,8],[82,9,82,19],[31,6,31,12],[31,14,31,20],[32,6,32,12],[32,14,32,20],[40,16,40,21],[1,1,1,33],[4,1,5,33],[7,1,7,5],[10,1,10,5],[10,6,10,14],[10,15,10,18],[10,19,10,33],[11,1,11,5],[11,6,11,14],[11,15,11,16],[11,17,11,18],[11,19,11,33],[7,7,7,10],[16,1,18,5],[22,1,22,5],[22,12,22,19],[22,20,22,24],[28,14,28,20],[27,6,27,12],[30,2,30,5],[29,2,29,5],[28,2,28,5],[30,6,30,12],[30,14,30,20],[25,21,25,33],[22,25,22,33],[16,29,16,30],[16,6,16,9],[16,10,16,16],[16,18,16,24],[18,6,18,9],[28,6,28,12],[17,6,17,9],[17,23,17,29],[12,1,12,5],[12,6,12,14],[12,15,12,16],[12,17,12,18],[12,19,12,33],[15,1,15,5],[25,2,25,5],[26,2,26,5],[27,2,27,5],[15,24,15,33],[21,6,21,9],[21,20,21,21],[17,11,17,14],[20,11,20,14],[19,29,19,30],[20,6,20,9],[27,14,27,20],[18,20,18,21],[19,1,20,5],[19,6,19,9],[19,10,19,16],[19,18,19,24],[20,23,20,29],[25,6,25,20],[31,2,31,5],[37,1,37,5],[37,9,37,18],[37,22,37,33],[44,18,44,23],[44,24,44,27],[44,14,44,17],[44,28,44,33],[44,8,44,9],[37,19,37,21],[36,16,36,33],[26,21,33,33],[29,6,29,12],[36,6,36,15],[26,6,26,12],[26,14,26,20],[40,22,40,33],[32,2,32,5],[33,2,33,5],[36,1,36,5],[29,14,29,20],[33,6,33,12],[33,14,33,20],[40,6,40,10],[45,14,45,17],[46,24,46,27],[46,16,46,20],[46,7,46,8],[43,8,43,9],[43,19,43,33],[40,1,40,5],[47,17,47,19],[47,7,47,16],[47,20,47,31],[45,18,45,26],[47,32,47,33],[45,8,45,9],[45,30,45,33],[46,10,46,11],[46,21,46,23],[40,11,40,15],[86,1,86,8],[86,9,86,19],[46,28,46,33],[50,1,50,5],[50,16,50,19],[52,6,52,14],[52,16,52,17],[52,18,52,19],[53,6,53,12],[53,13,53,19],[53,20,53,25],[53,26,53,33],[56,1,56,5],[56,16,56,19],[57,24,58,33],[58,16,58,17],[58,19,58,20],[58,22,58,23],[61,1,61,5],[61,16,61,19],[62,24,62,33],[83,13,84,19],[85,20,85,33],[63,30,63,33]]}
[]
[null,"【ルーター】システム設定 "]
[]
[]
[null,"※予めデフォルト設定している項目があります。それら設定がお客様ご運用において正しいかを必ずご確認のうえ、本設定シートを作成してください。なお、本シートに記載できない内容はサービス提供範囲外となります。"]
[]
[null,"1．機種"]
[null,"機種",null,null,null,null,"□","：ベーシックタイプY",null,null,null,"□","：ハイエンドタイプY",null,null,null,null,"□","：ハイエンド10GタイプY"]
[]
[null,"2．LANアドレス設定"]
[null,"LANインタフェース",null,null,null,null,"IPアドレス",null,null,null,null,null,null,null,null,"サブネットマスク",null,null,null,"備考"]
[null,"LAN1",null,null,null,null,"192.168.100.1",null,null,null,null,null,null,null,null,null,null,"(bit)",null,"LAN側インタフェース。デフォルト：192.168.100.1/24"]
[null,"LAN2",null,null,null,null,null,null,null,null,null,null,null,null,null,null,null,"(bit)",null,"ハイエンド/ハイエンド10GタイプY利用時の2つ目のLAN側インタフェースとして利用"]
[]
[null,"3．DHCPを使用する場合に設定してください（デフォルトでDHCPサーバ機能は有効です）。"]
[null,"DHCP機能",null,null,null,null,"☑","：DHCPサーバ",null,null,null,null,"□","：DHCPリレー",null,null,null,null,"□","：設定しない",null,null,null,null,{"$f":"IF(AND($G$16=\"☑\",$M$16=\"☑\"),\"エラー！どちらかを選択してください\",\"\")","v":""}]
[null,"LAN1DHCPサーバ",null,null,null,null,"割り当て範囲",null,null,null,null,null,null,null,null,null,null,"(～)",null,null,null,null,null,null,null,"サブネットマスク",null,null,null,null,null,"(bit)",24,24]
[null,null,null,null,null,null,"ゲートウェイ",null,null,null,"☑","：本ルーター",null,null,null,{"$f":"IF($K$18=\"☑\",\"□\",\"☑\")","v":"□"},"：本ルーター以外（IPアドレス=[",null,null,null,null,null,null,null,null,null,null,null,null,null,"］)"]
[null,null,null,null,null,null,"リース時間",null,null,null,"☑","：デフォルト(72時間)",null,null,null,null,{"$f":"IF($K$19=\"☑\",\"□\",\"☑\")","v":"□"},"：変更する (",null,null,null,null," )時間 (",null,null,")分","[無制限時、0 時間 0 分と記入]"]
[null,"LAN2DHCPサーバ",null,null,null,null,"割り当て範囲",null,null,null,null,null,null,null,null,null,null,"(～)",null,null,null,null,null,null,null,"サブネットマスク",null,null,null,null,null,"(bit)"]
[null,null,null,null,null,null,"ゲートウェイ",null,null,null,"☑","：本ルーター",null,null,null,{"$f":"IF($K$21=\"☑\",\"□\",\"☑\")","v":"□"},"：本ルーター以外（IPアドレス=[",null,null,null,null,null,null,null,null,null,null,null,null,null,"］)"]
[null,null,null,null,null,null,"リース時間",null,null,null,"☑","：デフォルト(72時間)",null,null,null,null,{"$f":"IF($K$22=\"☑\",\"□\",\"☑\")","v":"□"},"：変更する (",null,null,null,null," )時間 (",null,null,")分","[無制限時、0 時間 0 分と記入]"]
[null,"DHCPリレー",null,null,null,null,"DHCPサーバIPアドレス",null,null,null,null,null,null,null,null,null,null,null,null,null,"ゲートウェイアドレス"]
[]
[null,"    DHCPサーバの同一セグメント内での割り当て範囲の追加"]
[null,null,"インタフェース",null,null,null,"追加する割り当て範囲"]
[null,null,null,null,null,null,null,null,null,null,null,null,null,"(～)",null,null,null,null,null,null,null,"行数が足りない場合は、行挿入にてご利用ください。"]
[null,null,null,null,null,null,null,null,null,null,null,null,null,"(～)"]
[null,null,null,null,null,null,null,null,null,null,null,null,null,"(～)"]
[null,null,null,null,null,null,null,null,null,null,null,null,null,"(～)"]
[null,null,null,null,null,null,null,null,null,null,null,null,null,"(～)"]
[null,null,null,null,null,null,null,null,null,null,null,null,null,"(～)"]
[null,null,null,null,null,null,null,null,null,null,null,null,null,"(～)"]
[null,null,null,null,null,null,null,null,null,null,null,null,null,"(～)"]
[]
[null,"4．ルータにログインするための「管理パスワード」、「ユーザIDとユーザパスワード」を設定してください。"]
[null,"管理パスワード"]
[null,"ユーザの設定",null,null,null,null,"ユーザID",null,null,null,null,null,null,null,null,null,null,null,null,"ユーザパスワード"]
[]
[null,"5．時刻同期を行う場合に設定してください。"]
[null,"同期間隔",null,null,null,null,"使用しない",null,null,null,null,"NTPサーバ設定",null,null,null,null,"ntp.nict.jp(デフォルト）"]
[]
[null,"6．SYSLOGをSyslogサーバ、もしくは外部モメリにログを出力する場合に設定してください。"]
[null,"Syslogの種別",null,null,null,null,null,"☑","：INFO",null,null,"□","：Debug",null,null,"□","：Notice"]
[null,"Syslogサーバへの出力",null,null,null,null,null,"□","：する",null,{"$f":"IF($H$45=\"☑\",\"□\",\"☑\")","v":"☑"},"：しない",null,null,"宛先アドレス",null,null,null,null,null,null,null,null,null,"ゲートウェイ"]
[null,"外部メモリへの出力",null,null,null,null,null,"□","：する",null,{"$f":"IF($H$46=\"☑\",\"□\",\"☑\")","v":"☑"},"：しない",null,null,"ファイル名",null,null,null,null,null,null,null,null,null,null,null,null,"外部媒体",null,null,"USBメモリ"]
[null,null,null,null,null,null,null,"暗号化",null,"□","：する",null,{"$f":"IF($J$47=\"☑\",\"□\",\"☑\")","v":"☑"},"：しない",null,null,"暗号化アルゴリズム",null,null,null,null,"AES256",null,null,"パスワード"]
[null,null,null,null,null,null,null,"ファイルサイズの上限(デフォルト、10MB)",null,null,null,null,null,null,null,null,null,null,null,null,"バックアップファイルの最大数(デフォルト、10個)"]
[]
[null,"7．プロバイダ接続やフレッツVPNワイドの利用がない場合(例：NAT装置として利用する、L3SWのような使い方）"]
[null,"機種",null,null,null,null,null,null,null,null,null,null,null,null,null,{"$f":"G8","v":"□"},"：ベーシックタイプY",null,null,null,{"$f":"L8","v":"□"},"：ハイエンドタイプY",null,null,null,null,{"$f":"R8","v":"□"},"：ハイエンド10GタイプY"]
[null,{"$f":"IF(P51=\"☑\",\"WANを強制的にLANインタフェースとしての利用\",\"LAN3を強制的にLANインタフェースとしての利用\")","v":"LAN3を強制的にLANインタフェースとしての利用"},null,null,null,null,null,null,null,null,null,null,null,null,null,"□","：する",null,{"$f":"IF($P$52=\"☑\",\"□\",\"☑\")","v":"☑"},"：しない",null,{"$f":"IF(P51=\"☑\",\"\"\"する\"\"を時、WANはPPPoEの設定ができません。\",\"\"\"する\"\"を時、LAN3はPPPoEの設定ができません。\")","v":"\"する\"を時、LAN3はPPPoEの設定ができません。"}]
[null,{"$f":"IF(P51=\"☑\",\"WANアドレス\",\"LAN3アドレス\")","v":"LAN3アドレス"},null,null,null,null,null,null,null,null,null,null,null,null,null,"／",null,null,"(bit)"]
[null,"DNSサーバアドレス",null,null,null,null,null,null,null,null,null,null,null,null,null,null,null,null,null,null,"デフォルトゲートウェイ"]
[]
[null,"8．PPPoEパススルー機能"]
[null,"機種",null,null,null,null,null,null,null,null,null,null,null,null,null,{"$f":"G8","v":"□"},"：ベーシックタイプY",null,null,null,{"$f":"L8","v":"□"},"：ハイエンドタイプY",null,null,null,null,{"$f":"R8","v":"□"},"：ハイエンド10GタイプY"]
[null,"LAN側のホストからWAN側のPPPoEサーバへ接続する",null,null,null,null,null,null,null,null,null,null,null,null,null,"□","：する",null,{"$f":"IF($P$58=\"☑\",\"□\",\"☑\")","v":"☑"},"：しない",null,null,null,null,"中継されるPPPoEフレームはIPフィルターの精査が行われません。"]
[null,"LAN側インターフェースの指定",null,null,null,null,null,null,null,null,null,null,null,null,null,"□",{"$f":"IF(P57=\"☑\",\"LAN\",\"LAN1\")","v":"LAN1"},null,"□","LAN2",null,{"$f":"IF(P57=\"☑\",\"□\",\"☑\")","v":"☑"},"LAN3"]
[]
[null,"9．TELNET機能"]
[null,"機種",null,null,null,null,null,null,null,null,null,null,null,null,null,{"$f":"G8","v":"□"},"：ベーシックタイプY",null,null,null,{"$f":"L8","v":"□"},"：ハイエンドタイプY",null,null,null,null,{"$f":"R8","v":"□"},"：ハイエンド10GタイプY"]
[null,"TELNETサーバへ接続する",null,null,null,null,null,null,null,null,null,null,null,null,null,"□","：する",null,{"$f":"IF(P63=\"☑\",\"□\",\"☑\")","v":"☑"},"：しない"]
[null,"アクセス許可の種別",null,null,null,null,null,null,null,null,null,null,null,null,null,"□","：全て許可する",null,null,"□","：指定したインターフェース/IPアドレスのみ許可",null,null,null,null,null,null,null,null,"□","：全て許可しない"]
[null,"指定するインターフェース",null,null,null,null,null,null,null,null,null,null,null,null,null,"□",{"$f":"IF(P62=\"☑\",\"LAN\",IF(OR(U62=\"☑\",AA62=\"☑\"),\"LAN1\",\"LAN1\"))","v":"LAN1"},null,"□","LAN2",null,"□","LAN3",null,"□","IPアドレス"]
[null,"指定するIPアドレス"]
[]
[null,"10．ネットボランチDNS機能"]
[null,"ネットボランチDNS機能を利用する",null,null,null,null,null,null,null,null,null,null,null,null,null,"□","：する",null,"☑","：しない",null,null,"ネットボランチDNSをご利用になられる際には、③【ルーター】回線プロバイダ設定シートのPP[1］をインターフェースとして利用します。\nそのため、必ず別途プロバイダ契約と申込書のPP[1］を記載いただく必要がございます。\n※最終的なFQDNは【左記載内容】.XXX.netvolante.jpといった形となります。XXXの部分は設定作業時に自動で設定されますので、お客様で任意に決めることができません。お手数ですが、最終的なFQDNは設定作業後にセンタにお問い合わせください。"]
[null,"FQDN名"]
[]
[null,"11．特記事項"]
[]
[]
[]
[]
[]
[]
[]
[null,"12．サービス側使用欄"]
[null,"YNO　Description (契約ID)",null,null,null,null,null,null,null,{"$f":"①【ルーター】機能選択シート!$E$9&\"\"","v":""},null,null,null,null,null,null,null,null,null,null,"※サービス側で決定いたしますので、未記載でお願いいたします。"]
[null,"YNO　ユーザーID（クラウド管理サーバ　ユーザーID）",null,null,null,null,null,null,null,{"$f":"①【ルーター】機能選択シート!$J$9&\"\"","v":""},null,null,null,null,null,null,null,null,null,null,"※サービス側で決定いたしますので、未記載でお願いいたします。"]
[null,"YNO　パスワード（クラウド管理サーバ　パスワード）",null,null,null,null,null,null,null,{"$f":"①【ルーター】機能選択シート!$J$10&\"\"","v":""}]
[null,"YNO　ラベル",null,null,null,null,null,null,null,null,null,null,null,{"$f":"IF(①【ルーター】機能選択シート!$D$19=\"■\",\"（ｉ）\",\"\")","v":""},null,null,null,null,null,null,"※設置拠点都道府県名が入力されます。"]
[null,null,null,null,null,null,null,null,null,null,null,null,null,null,null,null,null,null,null,null,"※インターネット直収の際には末尾に(i)が付与されます。"]
[null,"YNO アラートメール送付先",null,null,null,null,null,null,null,null,null,null,null,null,null,null,null,null,null,null,"※メールはルーターがダウン時（オフライン）に送付となります。"]
[null,"L2MS利用",null,null,null,null,null,null,null,"有効",null,null,null,null,null,null,null,null,null,null,"アドレス設定しているインタフェースを有効にします。"]

{"sheet":"③【ルーター】回線プロバイダ設定","index":10,"n_rows":97,"n_cols":34,"rows_kept":97,"cut":false,"hidden":false,"merged":[[87,6,87,15],[82,26,82,29],[95,9,95,33],[96,1,96,8],[83,7,83,11],[83,13,83,15],[83,16,83,23],[83,24,83,25],[83,26,83,33],[87,16,87,33],[88,6,88,15],[88,16,88,19],[88,21,88,27],[88,29,88,33],[95,1,95,8],[89,1,89,5],[90,1,90,5],[89,6,89,11],[89,12,89,17],[89,21,89,33],[90,6,90,9],[90,10,90,33],[91,1,91,5],[91,7,91,11],[91,13,91,15],[91,16,91,23],[91,24,91,25],[91,26,91,33],[82,30,82,33],[83,1,83,5],[79,1,79,5],[79,6,79,11],[79,12,79,17],[79,21,79,27],[79,29,79,33],[80,6,80,9],[81,6,81,9],[81,30,81,33],[80,1,80,5],[80,10,80,33],[81,1,82,5],[81,10,81,15],[81,16,81,20],[81,21,81,24],[81,25,81,29],[82,6,82,9],[82,10,82,14],[82,15,82,20],[71,6,71,9],[71,10,71,23],[71,24,71,33],[72,1,72,9],[72,10,72,16],[72,17,72,18],[72,19,72,23],[82,21,82,25],[73,1,73,5],[73,7,73,11],[73,13,73,15],[73,16,73,23],[73,24,73,25],[73,26,73,33],[77,6,77,15],[77,16,77,33],[78,6,78,15],[78,16,78,19],[78,21,78,27],[78,29,78,33],[70,1,71,5],[67,6,67,15],[67,16,67,33],[68,6,68,15],[68,16,68,19],[68,21,68,27],[68,29,68,33],[70,10,70,19],[70,20,70,23],[70,24,70,33],[69,7,69,11],[69,13,69,17],[69,21,69,27],[69,29,69,33],[70,6,70,9],[19,22,19,32],[14,1,14,5],[39,1,39,5],[20,1,20,5],[23,6,23,9],[21,1,28,5],[25,11,25,19],[21,6,22,9],[14,16,14,23],[15,1,15,5],[17,1,17,5],[18,27,18,32],[14,7,14,11],[14,26,14,33],[15,16,15,23],[15,25,15,32],[16,1,16,5],[16,16,16,17],[22,25,22,31],[23,23,23,31],[24,6,28,9],[24,11,24,19],[24,23,24,31],[25,23,25,31],[40,1,41,5],[40,7,40,33],[41,10,41,16],[29,1,32,9],[29,17,32,33],[36,6,36,33],[37,20,37,33],[39,6,39,8],[39,9,39,15],[39,16,39,18],[39,19,39,24],[41,7,41,9],[38,7,38,15],[38,17,38,33],[39,28,39,33],[38,1,38,5],[1,1,1,33],[11,6,11,33],[13,1,13,5],[7,1,7,5],[3,1,4,33],[6,1,6,5],[6,20,6,33],[13,11,13,14],[13,15,13,16],[13,17,13,19],[13,20,13,23],[13,24,13,26],[13,27,13,29],[13,30,13,33],[7,18,7,33],[55,10,57,33],[60,11,60,19],[60,23,60,31],[49,27,49,32],[50,6,50,13],[50,22,50,32],[48,24,48,28],[48,15,48,22],[48,30,48,33],[49,24,49,26],[50,19,50,21],[48,6,48,13],[49,6,49,13],[45,6,47,33],[42,7,42,9],[44,7,44,9],[27,11,27,19],[27,23,27,31],[28,11,28,19],[28,23,28,31],[26,11,26,19],[26,23,26,31],[48,1,52,5],[51,6,52,33],[43,18,43,33],[63,11,63,19],[63,23,63,31],[53,1,53,5],[54,1,63,5],[54,26,54,32],[58,23,58,31],[59,6,63,9],[59,11,59,19],[62,11,62,19],[62,23,62,31],[59,23,59,31],[61,11,61,19],[61,23,61,31],[58,6,58,9],[54,6,57,9],[42,1,43,5],[42,10,42,16],[42,18,42,33],[44,1,47,5],[44,10,44,16],[44,18,44,24]]}
[]
[null,"【ルーター】回線・プロバイダ設定 "]
[]
[null,"※予めデフォルト設定している項目があります。それら設定がお客様ご運用において正しいかを必ずご確認のうえ、本設定シートを作成してください。なお、本シートに記載できない内容はサービス提供範囲外となります。"]
[]
[null,"1．共通"]
[null,"インターフェイス",null,null,null,null,"☑","：WAN(ハイエンド/ハイエンド10GタイプYの場合LAN3)",null,null,null,null,null,null,null,null,null,null,null,null,{"$f":"IF($G$7=\"☑\",\"\",\"エラー！チェックがありません\")","v":""}]
[null,"回線種別",null,null,null,null,"☑","：光ネクスト/光クロス",null,null,null,null,{"$f":"IF($G$8=\"☑\",\"□\",\"☑\")","v":"□"},"：他回線"]
[]
[null,"2．プロバイダー(ISP)設定情報 < PP[1] >"]
[null,"利用有無",null,null,null,null,{"$f":"IF(①【ルーター】機能選択シート!$D$19=\"■\",\"■：利用する\",\"□：利用しない\")","v":"□：利用しない"}]
[null,"設定名(任意)"]
[null,"接続形態[PP1]",null,null,null,null,"☑","：PPPoE(IPv4)",null,null,null,null,{"$f":"IF($G$13=\"☑\",\"□\",\"☑\")","v":"□"},"：DHCP・固定IP"]
[null,"接続アカウント情報",null,null,null,null,"☑","：ISP情報あり",null,null,{"$f":"IF(G14=\"☑\",\"□\",\"☑\")","v":"□"},"：未定(ISP情報をdummyでキッティングセンタでは設定し、現地に機器が届いた後に、営業にてGUIでISP情報を正しいものに修正する)",null,null,null,"ユーザID",null,{"$f":"IF(AND(G14=\"☑\",U14=\"\"),\"右セルを入力→\",IF(K14=\"☑\",\"dummy\",U14))","v":"右セルを入力→"},null,null,null,null,null,null,"パスワード",null,null,{"$f":"IF(AND(G14=\"☑\",AE14=\"\"),\"右セルを入力→\",IF(K14=\"☑\",\"dummy\",AE14))","v":"右セルを入力→"}]
[null,"WAN側IPアドレス",null,null,null,null,"☑","：自動取得(IPCP)",null,null,null,null,"□","：設定する(",null,null,null,null,null,null,null,null,null,null,")",{"$f":"IF(AND($G$15=\"□\",$M$15=\"□\"),\"☑\",\"□\")","v":"□"},"：設定しない"]
[null,"DNSサーバー",null,null,null,null,"☑","：自動取得",null,null,null,null,"□","：設定する(",null,null,null,null,null,null,null,null,null,null,")(",null,null,null,null,null,null,null,null,")"]
[null,"MTU",null,null,null,null,"☑","：自動",null,null,null,null,"□","：設定する(                )",null,null,null,null,")"]
[null,"NAT",null,null,null,null,"変換方法",null,null,null,null,null,null,null,"☑","：IPマスカレード",null,null,null,{"$f":"IF($O$18=\"☑\",\"□\",\"☑\")","v":"□"},"：設定しない"]
[null,null,null,null,null,null,"変換後の送信元IPアドレス",null,null,null,null,null,null,null,"☑","：WAN側IPアドレス(自動取得）",null,null,null,null,null,null,null,{"$f":"IF($O$19=\"☑\",\"□\",\"☑\")","v":"□"},"：設定する(",null,null,null,null,null,null,null,null,")"]
[null,null,null,null,null,null,"変換前の対象送信元IPアドレス",null,null,null,null,null,null,null,"☑","：すべて",null,null,{"$f":"IF($O$20=\"☑\",\"□\",\"☑\")","v":"□"},"：設定する(",null,null,null,null,null,null,null,null,null,null,null,null,null,")"]
[null,"IPフィルタ",null,null,null,null,"☑","：LANからWANへの通信は許可し、WANからLANへのアクセスは制限する",null,null,null,null,null,null,null,null,null,null,null,null,null,null,null,null,null,null,null,{"$f":"IF($G$21=\"☑\",\"□\",\"☑\")","v":"□"},"：設定しない"]
[null,"経路設定\n\n\n※10以上の設定が必要な場合、行挿入してご利用ください。\n",null,null,null,null,"デフォルト\nゲートウェイ\n",null,null,null,"☑","：すべて（＝インターネット向け）の通信はこのPPインタフェースをデフォルトに設定する"]
[null,null,null,null,null,null,null,null,null,null,{"$f":"IF(OR($P$23=\"☑\",$K$22=\"☑\"),\"□\",\"☑\")","v":"□"},"：設定しない",null,null,null,"□","：他のネットワーク機器に設定する（",null,null,null,null,null,null,null,null,null,null,null,null,null,null,null,")"]
[null,null,null,null,null,null,"他の宛先経路",null,null,null,"（例：　　8.8.8.8",null,null,null,null,null,null,null,null,null,")",null,"（",null,null,null,null,null,null,null,null,null,")"]
[null,null,null,null,null,null,"(デフォルトゲートウェイを設定しない場合、このPPインタフェースをゲートウェイとする特定の宛先を記入)",null,null,null,"（",null,null,null,null,null,null,null,null,null,")",null,"（",null,null,null,null,null,null,null,null,null,")"]
[null,null,null,null,null,null,null,null,null,null,"（",null,null,null,null,null,null,null,null,null,")",null,"（",null,null,null,null,null,null,null,null,null,")"]
[null,null,null,null,null,null,null,null,null,null,"（",null,null,null,null,null,null,null,null,null,")",null,"（",null,null,null,null,null,null,null,null,null,")"]
[null,null,null,null,null,null,null,null,null,null,"（",null,null,null,null,null,null,null,null,null,")",null,"（",null,null,null,null,null,null,null,null,null,")"]
[null,null,null,null,null,null,null,null,null,null,"（",null,null,null,null,null,null,null,null,null,")",null,"（",null,null,null,null,null,null,null,null,null,")"]
[null,"ネットワークに存在する複数セグメント(LAN1以外）からのインターネット接続の有無",null,null,null,null,null,null,null,null,"☑","：すべて許可する",null,null,null,null,null,"特定の\"許可しない/許可する\"セグメントがある場合、「①【ルーター】機能選択シート」で”11.IPフィルタの追加\"を\"■(有効)\"に変更し、「⑨【ルーター】静的IPフィルタ設定」シートにてインターフェースを「特定セグメント」を選択してIPフィルタを設定してください。"]
[]
[]
[null,null,null,null,null,null,null,null,null,null,{"$f":"IF($K$30=\"☑\",\"□\",\"☑\")","v":"□"},"：すべて許可しない"]
[]
[null,"3．フレッツVPNワイド設定情報 < 2．プロバイダー設定がある場合はPP[2]、ない場合はPP[1] >"]
[null,"利用有無",null,null,null,null,{"$f":"IF(①【ルーター】機能選択シート!$D$21=\"■\",\"■：利用する\",\"□：利用しない\")","v":"□：利用しない"}]
[null,"設定名(任意)"]
[null,"接続形態[PPn]",null,null,null,null,"☑","：PPPoE",null,null,null,null,null,null,null,null,null,null,null,null,{"$f":"IF($G$38=\"☑\",\"\",\"エラー！チェックがありません\")","v":""}]
[null,"契約種別",null,null,null,null,"☑","：端末型払い出し",null,null,null,null,null,null,null,null,{"$f":"IF($G$39=\"☑\",\"□\",\"☑\")","v":"□"},"：LAN型払い出し"]
[null,"接続アカウント",null,null,null,null,"ユーザID",null,null,null,null,null,null,null,null,null,"企業識別子",null,null,null,null,null,null,null,null,"パスワード"]
[null,"WAN側IPアドレス\n(端末型払い出し時)",null,null,null,null,"☑","：自動取得(IPCP)"]
[null,null,null,null,null,null,{"$f":"IF($G$41=\"☑\",\"□\",\"☑\")","v":"□"},"：設定する(",null,null,null,null,null,null,null,null,null,")"]
[null,"WAN側IPアドレス\n(LAN型払い出し時)",null,null,null,null,{"$f":"IF($G$44=\"☑\",\"□\",\"☑\")","v":"□"},"：設定する(",null,null,null,null,null,null,null,null,null,")","払い出したネットワークアドレスの中から１つを割り当ててください。"]
[null,null,null,null,null,null,"☑","：設定しない"]
[null,"DNSサーバー\n(必ず、どちらかを選択してください）",null,null,null,null,"□","：設定する(",null,null,null,null,null,null,null,null,null,")(",null,null,null,null,null,null,null,")","□","：設定しない"]
[null,null,null,null,null,null,"①本機に\"2.プロバイダー設定\"がなく、他機器からインターネット接続する構成では、DNSサーバーの設定が必要です。通常、\n　 インターネットに接続する機器のIPアドレスもしくはお客様のDNSサーバーのIPアドレスを設定します。\n②本機に\"2.プロバイダー設定\"があり、本ルータからインターネット接続する構成では、ここでのDNSサーバーの設定は不要です。\n"]
[]
[]
[null,"NAT\n",null,null,null,null,"種別",null,null,null,null,null,null,null,"☑","：IPマスカレード",null,null,null,null,null,null,null,"□","：NAT",null,null,null,null,{"$f":"IF(AND($G$39=\"☑\",$O$49=\"☑\"),\"□\",IF(AND($G$39=\"□\",$X$49=\"☑\"),\"□\",\"☑\"))","v":"□"},"：設定しない"]
[null,null,null,null,null,null,"変換後の送信元IPアドレス",null,null,null,null,null,null,null,"☑","：WAN側IPアドレス",null,null,null,null,null,null,null,{"$f":"IF($O$50=\"☑\",\"□\",\"☑\")","v":"□"},"：設定する( ",null,null,null,null,null,null,null,null,")"]
[null,null,null,null,null,null,"変換前の対象送信元IPアドレス",null,null,null,null,null,null,null,"☑","：すべて",null,null,{"$f":"IF($O$51=\"☑\",\"□\",\"☑\")","v":"□"},"：設定する(",null,null,null,null,null,null,null,null,null,null,null,null,null,")"]
[null,null,null,null,null,null,"種別＝☑：NAT を選択した場合、「【ルーター】機能選択シート」で”12.NATの追加\"を\"■(有効)\"に変更し、「【ルーター】NAT設定」シートにて静的NATを設定してください。"]
[]
[null,"IPフィルタ",null,null,null,null,{"$f":"IF($AB$54=\"☑\",\"□\",\"☑\")","v":"□"},"：LANからWANへの通信は許可し、WANからLANへのアクセスは制限する",null,null,null,null,null,null,null,null,null,null,null,null,null,null,null,null,null,null,null,"☑","：設定しない"]
[null,"経路設定\n\n\n\n\n※10以上の設定が必要な場合、行挿入してご利用ください。\n",null,null,null,null,"デフォルト\nゲートウェイ",null,null,null,"☑","：設定しない",null,null,null,null,null,null,null,{"$f":"IF($K$55=\"☑\",\"□\",\"☑\")","v":"□"},"：他のネットワーク機器(",null,null,null,null,null,null,null,null,null,null,null,null,")"]
[null,null,null,null,null,null,null,null,null,null,"フレッツVPNワイド側にデフォルトゲートウェイを設定しないケースが多く、本社－拠点間でIPSecトンネルを接続している構成では、拠点側のデフォルトゲートウェイは本社向けのIPSecトンネルに設定することが通常です。\n本社側では、インターネット接続する機器にデフォルトゲートウェイを設定することが通常です。"]
[]
[]
[null,null,null,null,null,null,"他の宛先経路",null,null,null,"（例：　　192.168.101.2",null,null,null,null,null,null,null,null,null,")",null,"（",null,null,null,null,null,null,null,null,null,")"]
[null,null,null,null,null,null,"(デフォルトゲートウェイを設定しない場合、このPPインタフェースをゲートウェイとする特定の宛先を記入)",null,null,null,"（",null,null,null,null,null,null,null,null,null,")",null,"（",null,null,null,null,null,null,null,null,null,")"]
[null,null,null,null,null,null,null,null,null,null,"（",null,null,null,null,null,null,null,null,null,")",null,"（",null,null,null,null,null,null,null,null,null,")"]
[null,null,null,null,null,null,null,null,null,null,"（",null,null,null,null,null,null,null,null,null,")",null,"（",null,null,null,null,null,null,null,null,null,")"]
[null,null,null,null,null,null,null,null,null,null,"（",null,null,null,null,null,null,null,null,null,")",null,"（",null,null,null,null,null,null,null,null,null,")"]
[null,null,null,null,null,null,null,null,null,null,"（",null,null,null,null,null,null,null,null,null,")",null,"（",null,null,null,null,null,null,null,null,null,")"]
[]
[null,"4.1 OCN光 IPv6 IPoEサービス ( IPv4 over IPv6 ) 接続設定情報 < TUNNEL >"]
[null,"利用有無",null,null,null,null,{"$f":"IF(①【ルーター】機能選択シート!D22=データシート!AA4,\"■：利用する\",\"□：利用しない\")","v":"□：利用しない"}]
[null,"CAF番号"]
[null,"設定名",null,null,null,null,null,null,null,null,null,null,null,null,null,null,"アドレス配布方式",null,null,null,"☑","：契約していない（RA）",null,null,null,null,null,null,{"$f":"IF($U$69=\"☑\",\"□\",\"☑\")","v":"□"},"：契約している（DHCPv6-PD）"]
[null,"プラン",null,null,null,null,"☑","：標準プラン",null,null,null,null,{"$f":"IF($G$70=\"☑\",\"□\",\"☑\")","v":"□"},"：ワイドプラン",null,null,null,null,"契約IP",null,"□","：シェアードアドレス契約（動的IP）",null,null,null,null,null,null,{"$f":"IF($U$70=\"☑\",\"□\",\"☑\")","v":"☑"},"：固定 IP 1 契約"]
[null,"固定 IP 1 契約",null,null,null,null,"アドレス解決システムURL",null,null,null,null,null,null,null,null,null,null,null,null,null,"認証用 ID"]
[null,null,null,null,null,null,"認証用パスワード"]
[null,"OCNから通知のお客さまネットワークアドレス（IPv4）",null,null,null,null,null,null,null,null,null,null,null,null,null,null,null,"マスク"]
[null,"DNSサーバー自動取得／設定",null,null,null,null,"☑","：DHCP LAN3 / WAN",null,null,null,null,{"$f":"IF($G$74=\"☑\",\"□\",\"☑\")","v":"□"},"：指定　第１",null,null,null,null,null,null,null,null,null,null,"第2"]
[]
[null,"4.2 BizConecta IPv6 IPoEサービス ( IPv4 over IPv6 ) 接続設定情報 < TUNNEL > "]
[null,"利用有無",null,null,null,null,{"$f":"IF(①【ルーター】機能選択シート!D22=データシート!AA5,\"■：利用する\",\"□：利用しない\")","v":"□：利用しない"}]
[null,"お客様番号"]
[null,"設定名",null,null,null,null,null,null,null,null,null,null,null,null,null,null,"アドレス配布方式",null,null,null,"☑","：契約していない（RA）",null,null,null,null,null,null,{"$f":"IF($U$79=\"☑\",\"□\",\"☑\")","v":"□"},"：契約している（DHCPv6-PD）"]
[null,null,null,null,null,null,null,null,null,null,null,null,null,null,null,null,null,null,"契約IP",null,"☑","：DS-Lite 契約",null,null,null,null,null,null,{"$f":"IF($U$80=\"☑\",\"□\",\"☑\")","v":"□"},"：固定 IP 契約"]
[null,"DS-Lite 契約",null,null,null,null,"AFTRのFQDN",null,null,null,"<一般向けに開示されていないためキッティング時に設定します。>"]
[null,"固定 IP 契約",null,null,null,null,"アップデートサーバURL",null,null,null,null,null,null,null,null,null,"アップデートサーバ用ユーザー名",null,null,null,null,null,null,null,null,"アップデートサーバ用パスワード"]
[null,null,null,null,null,null,"インターフェースID",null,null,null,null,null,null,null,null,"トンネル終端(BR)IPv6アドレス",null,null,null,null,null,null,null,null,null,null,"CPE側v4アドレス"]
[null,"DNSサーバー自動取得／設定",null,null,null,null,"☑","：DHCP WAN",null,null,null,null,{"$f":"IF($G$84=\"☑\",\"□\",\"☑\")","v":"□"},"：指定　第１",null,null,null,null,null,null,null,null,null,null,"第2"]
[]
[null,"4.3 v6コネクト IPv6 IPoEサービス ( IPv4 over IPv6 ) 接続設定情報 < TUNNEL >"]
[null,"利用有無",null,null,null,null,{"$f":"IF(①【ルーター】機能選択シート!D22=データシート!AA6,\"■：利用する\",\"□：利用しない\")","v":"□：利用しない"}]
[null,"CAF番号"]
[null,"設定名",null,null,null,null,null,null,null,null,null,null,null,null,null,null,"アドレス配布方式",null,null,null,"☑","：契約していない（RA）",null,null,null,null,null,null,{"$f":"IF($U$89=\"☑\",\"□\",\"☑\")","v":"□"},"：契約している（DHCPv6-PD）"]
[null,null,null,null,null,null,null,null,null,null,null,null,null,null,null,null,null,null,"契約IP",null,"☑","：v6 コネクト IPv4 over IPv6 接続 (DS-Lite)"]
[null,"DS-Lite 契約",null,null,null,null,"AFTRのFQDN",null,null,null,"<一般向けに開示されていないためキッティング時に設定します。>"]
[null,"DNSサーバー自動取得／設定",null,null,null,null,"☑","：DHCP WAN",null,null,null,null,{"$f":"IF($G$92=\"☑\",\"□\",\"☑\")","v":"□"},"：指定　第１",null,null,null,null,null,null,null,null,null,null,"第2"]
[]
[null,"5．フレッツ光のセキュリティ対策ツール・リモートサポートツール等の利用"]
[null,"利用有無",null,null,null,null,{"$f":"IF(①【ルーター】機能選択シート!$D$20=\"■\",\"■：利用する\",\"□：利用しない\")","v":"□：利用しない"}]
[null,"設定名(任意)"]
[null,"IPv6プレフィックスの配布方法",null,null,null,null,null,null,null,"☑","：RA",null,null,{"$f":"IF($J$97=\"☑\",\"□\",\"☑\")","v":"□"},"：DHCPv6-PD",null,null,null,null,null,"(構成、契約をご確認ください）",null,null,null,null,null,null,null,"[利用予定含む]"]

{"sheet":"④【ルーター】タグVLAN設定","index":11,"n_rows":130,"n_cols":34,"rows_kept":130,"cut":false,"hidden":false,"merged":[[1,1,1,33],[10,1,11,33],[3,1,4,33],[21,27,21,32],[22,13,22,16],[17,1,18,5],[17,6,18,7],[17,8,17,14],[17,20,17,25],[17,27,17,32],[18,13,18,16],[13,1,14,5],[13,6,14,7],[16,26,16,32],[18,26,18,32],[19,1,20,5],[19,6,20,7],[19,8,19,14],[19,20,19,25],[19,27,19,32],[20,13,20,16],[13,17,13,33],[20,26,20,32],[5,1,7,33],[25,1,26,5],[25,6,26,7],[25,8,25,14],[25,20,25,25],[25,27,25,32],[26,13,26,16],[14,8,14,33],[15,1,16,5],[15,6,16,7],[15,8,15,14],[15,20,15,25],[15,27,15,32],[16,13,16,16],[23,1,24,5],[23,6,24,7],[23,8,23,14],[23,20,23,25],[23,27,23,32],[24,13,24,16],[21,1,22,5],[21,6,22,7],[21,8,21,14],[21,20,21,25],[26,26,26,32],[29,1,30,5],[29,6,30,7],[29,8,29,14],[29,20,29,25],[29,27,29,32],[30,13,30,16],[27,1,28,5],[27,6,28,7],[27,8,27,14],[27,20,27,25],[27,27,27,32],[28,13,28,16],[30,26,30,32],[28,26,28,32],[24,26,24,32],[22,26,22,32],[35,8,35,14],[35,20,35,25],[33,6,34,7],[33,8,33,14],[33,20,33,25],[33,27,33,32],[34,13,34,16],[31,1,32,5],[31,6,32,7],[31,8,31,14],[31,20,31,25],[31,27,31,32],[32,13,32,16],[32,26,32,32],[54,1,55,5],[54,6,55,7],[54,8,54,14],[54,20,54,25],[54,27,54,32],[55,13,55,16],[39,1,40,5],[39,6,40,7],[39,8,39,14],[39,20,39,25],[39,27,39,32],[40,13,40,16],[41,1,42,5],[41,6,42,7],[41,8,41,14],[41,20,41,25],[41,27,41,32],[58,1,59,5],[58,6,59,7],[58,8,58,14],[47,1,47,5],[49,1,49,12],[50,1,51,5],[50,6,51,7],[51,8,51,33],[52,1,53,5],[52,6,53,7],[52,8,52,14],[52,20,52,25],[52,27,52,32],[53,13,53,16],[58,20,58,25],[58,27,58,32],[59,13,59,16],[56,1,57,5],[56,6,57,7],[56,8,56,14],[56,20,56,25],[56,27,56,32],[57,13,57,16],[57,26,57,32],[62,1,63,5],[62,6,63,7],[62,8,62,14],[62,20,62,25],[62,27,62,32],[63,13,63,16],[60,1,61,5],[60,6,61,7],[60,8,60,14],[60,20,60,25],[60,27,60,32],[61,13,61,16],[66,1,67,5],[66,6,67,7],[66,8,66,14],[66,20,66,25],[66,27,66,32],[67,13,67,16],[64,1,65,5],[64,6,65,7],[64,8,64,14],[64,20,64,25],[64,27,64,32],[65,13,65,16],[70,1,71,5],[70,6,71,7],[70,8,70,14],[70,20,70,25],[70,27,70,32],[71,13,71,16],[68,1,69,5],[68,6,69,7],[68,8,68,14],[68,20,68,25],[68,27,68,32],[69,13,69,16],[84,1,84,5],[74,1,75,5],[74,6,75,7],[74,8,74,14],[74,20,74,25],[74,27,74,32],[75,13,75,16],[72,1,73,5],[72,6,73,7],[72,8,72,14],[72,20,72,25],[72,27,72,32],[73,13,73,16],[76,1,77,5],[76,6,77,7],[76,8,76,14],[76,20,76,25],[76,27,76,32],[77,13,77,16],[78,1,79,5],[78,6,79,7],[82,1,83,5],[82,6,83,7],[82,20,82,25],[42,13,42,16],[37,1,38,5],[37,6,38,7],[37,8,37,14],[37,20,37,25],[37,27,37,32],[38,13,38,16],[35,1,36,5],[35,6,36,7],[36,13,36,16],[44,13,44,16],[45,1,46,5],[45,6,46,7],[45,8,45,14],[45,20,45,25],[45,27,45,32],[46,13,46,16],[46,26,46,32],[44,26,44,32],[82,27,82,32],[83,13,83,16],[78,8,78,14],[78,20,78,25],[78,27,78,32],[79,13,79,16],[80,1,81,5],[80,6,81,7],[80,8,80,14],[80,20,80,25],[80,27,80,32],[81,13,81,16],[83,26,83,32],[81,26,81,32],[79,26,79,32],[82,8,82,14],[89,1,91,33],[93,9,93,10],[93,22,93,23],[93,2,93,6],[93,15,93,19],[92,2,92,6],[92,7,92,14],[92,15,92,19],[92,20,92,27],[93,11,93,12],[93,13,93,14],[93,7,93,8],[93,20,93,21],[93,24,93,25],[93,26,93,27],[94,2,94,6],[94,7,94,8],[94,9,94,10],[94,11,94,12],[94,13,94,14],[94,15,94,19],[94,20,94,21],[94,22,94,23],[94,24,94,25],[94,26,94,27],[98,2,98,6],[98,7,98,8],[98,9,98,10],[98,11,98,12],[98,13,98,14],[98,15,98,19],[98,20,98,21],[98,22,98,23],[98,24,98,25],[98,26,98,27],[96,2,96,6],[96,7,96,8],[96,9,96,10],[96,11,96,12],[96,13,96,14],[96,15,96,19],[96,20,96,21],[96,22,96,23],[96,24,96,25],[96,26,96,27],[97,2,97,6],[97,7,97,8],[97,9,97,10],[99,2,99,6],[99,7,99,8],[99,9,99,10],[99,11,99,12],[99,13,99,14],[99,15,99,19],[99,20,99,21],[99,22,99,23],[99,24,99,25],[99,26,99,27],[104,2,104,6],[104,7,104,8],[104,9,104,10],[104,11,104,12],[104,13,104,14],[104,15,104,19],[104,20,104,21],[104,22,104,23],[104,24,104,25],[104,26,104,27],[100,2,100,6],[100,7,100,8],[100,9,100,10],[100,11,100,12],[100,13,100,14],[100,15,100,19],[100,20,100,21],[100,22,100,23],[100,24,100,25],[100,26,100,27],[101,2,101,6],[101,7,101,8],[101,9,101,10],[105,26,105,27],[106,2,106,6],[106,7,106,8],[106,9,106,10],[106,11,106,12],[106,13,106,14],[106,15,106,19],[106,20,106,21],[106,22,106,23],[106,24,106,25],[106,26,106,27],[105,2,105,6],[105,7,105,8],[105,9,105,10],[105,11,105,12],[105,13,105,14],[105,15,105,19],[105,20,105,21],[105,22,105,23],[105,24,105,25],[108,26,108,27],[107,2,107,6],[107,7,107,8],[107,9,107,10],[107,11,107,12],[107,13,107,14],[107,15,107,19],[107,20,107,21],[107,22,107,23],[107,24,107,25],[97,11,97,12],[97,13,97,14],[97,15,97,19],[97,20,97,21],[97,22,97,23],[97,24,97,25],[97,26,97,27],[95,2,95,6],[95,7,95,8],[95,9,95,10],[95,11,95,12],[95,13,95,14],[95,15,95,19],[95,20,95,21],[95,22,95,23],[95,24,95,25],[95,26,95,27],[101,11,101,12],[101,13,101,14],[101,15,101,19],[101,20,101,21],[101,22,101,23],[101,24,101,25],[101,26,101,27],[102,2,102,6],[102,7,102,8],[102,9,102,10],[102,11,102,12],[102,13,102,14],[102,15,102,19],[102,20,102,21],[102,22,102,23],[102,24,102,25],[102,26,102,27],[116,2,116,6],[116,7,116,13],[116,15,116,21],[103,26,103,27],[110,1,111,33],[103,2,103,6],[103,7,103,8],[103,9,103,10],[103,11,103,12],[103,13,103,14],[103,15,103,19],[103,20,103,21],[103,22,103,23],[103,24,103,25],[107,26,107,27],[108,2,108,6],[108,7,108,8],[108,9,108,10],[108,11,108,12],[108,13,108,14],[108,15,108,19],[108,20,108,21],[108,22,108,23],[108,24,108,25],[113,2,113,6],[114,7,114,13],[114,15,114,21],[113,22,113,33],[113,7,113,21],[114,2,114,6],[115,2,115,6],[115,7,115,13],[115,15,115,21],[120,15,120,21],[121,2,121,6],[121,7,121,13],[121,15,121,21],[122,2,122,6],[122,7,122,13],[122,15,122,21],[117,2,117,6],[117,7,117,13],[117,15,117,21],[118,2,118,6],[118,7,118,13],[118,15,118,21],[119,2,119,6],[119,7,119,13],[119,15,119,21],[129,2,129,6],[129,7,129,13],[129,15,129,21],[114,22,129,33],[126,2,126,6],[126,7,126,13],[126,15,126,21],[127,2,127,6],[127,7,127,13],[127,15,127,21],[128,2,128,6],[128,7,128,13],[128,15,128,21],[123,2,123,6],[123,7,123,13],[123,15,123,21],[124,2,124,6],[124,7,124,13],[124,15,124,21],[125,2,125,6],[125,7,125,13],[125,15,125,21],[120,2,120,6],[120,7,120,13],[33,1,34,5],[43,1,44,5],[43,6,44,7],[43,8,43,14],[43,20,43,25],[55,26,55,32],[53,26,53,32],[77,26,77,32],[42,26,42,32],[40,26,40,32],[38,26,38,32],[36,26,36,32],[34,26,34,32],[75,26,75,32],[73,26,73,32],[71,26,71,32],[69,26,69,32],[67,26,67,32],[65,26,65,32],[63,26,63,32],[61,26,61,32],[59,26,59,32],[35,27,35,32],[43,27,43,32]]}
[]
[null,"【ルーター】タグVLAN設定 "]
[]
[null,"※予めデフォルト設定している項目があります。それら設定がお客様ご運用において正しいかを必ずご確認のうえ、本設定シートを作成してください。なお、本シートに記載できない内容はサービス提供範囲外となります。"]
[]
[null,"※タグVLANかつスイッチオプション構成において、スイッチオプション配下の <デフォルトVLAN以外を設定したアクセスポート> ではセキュリティ対策ツールは使用できません。(IPv6の仕様上、/64より細かいサブネットの分割できないため)。\nセキュリティ対策ツールを使用する場合はルータのLANポートもしくは <デフォルトVLANを設定したアクセスポート> に接続ください。"]
[]
[]
[]
[null,"タグVLANをルータのLAN1もしくはLAN2インタフェースに設定します。"]
[null,"※タグVLAN最大数は、LAN1で\"32\"、もしくは「LAN1で\"16\"＋LAN2で\"16\"」です。"]
[]
[null,"1．LAN1インタフェース"]
[null,"VLAN名前",null,null,null,null,"VlanID",null,"ルーターのIPアドレス/サブネット(bit)",null,null,null,null,null,null,null,null,"DHCPサーバ機能利用有無と払い出しIPアドレス範囲"]
[null,null,null,null,null,null,null,null,"DHCPサーバ利用時のゲートウェイの設定(本ルータか他の機器）"]
[null,null,null,null,null,null,null,null,null,null,null,null,null,null,null,"/",null,"☑","：する(",null,null,null,null,null,null,null,"～",null,null,null,null,null,null,")"]
[null,null,null,null,null,null,null,null,"ゲートウェイ",null,null,null,"☑","：本ルータ",null,null,null,{"$f":"IF($M$17=\"☑\",\"□\",\"☑\")","v":"□"},"：本ルータ以外（IPアドレス=[",null,null,null,null,null,null,null,null,null,null,null,null,null,null,"］)"]
[null,null,null,null,null,null,null,null,null,null,null,null,null,null,null,"/",null,"□","：する(",null,null,null,null,null,null,null,"～",null,null,null,null,null,null,")"]
[null,null,null,null,null,null,null,null,"ゲートウェイ",null,null,null,"☑","：本ルータ",null,null,null,{"$f":"IF($M$19=\"☑\",\"□\",\"☑\")","v":"□"},"：本ルータ以外（IPアドレス=[",null,null,null,null,null,null,null,null,null,null,null,null,null,null,"］)"]
[null,null,null,null,null,null,null,null,null,null,null,null,null,null,null,"/",null,"□","：する(",null,null,null,null,null,null,null,"～",null,null,null,null,null,null,")"]
[null,null,null,null,null,null,null,null,"ゲートウェイ",null,null,null,"☑","：本ルータ",null,null,null,{"$f":"IF($M$21=\"☑\",\"□\",\"☑\")","v":"□"},"：本ルータ以外（IPアドレス=[",null,null,null,null,null,null,null,null,null,null,null,null,null,null,"］)"]
[null,null,null,null,null,null,null,null,null,null,null,null,null,null,null,"/",null,"□","：する(",null,null,null,null,null,null,null,"～",null,null,null,null,null,null,")"]
[null,null,null,null,null,null,null,null,"ゲートウェイ",null,null,null,"☑","：本ルータ",null,null,null,{"$f":"IF($M$23=\"☑\",\"□\",\"☑\")","v":"□"},"：本ルータ以外（IPアドレス=[",null,null,null,null,null,null,null,null,null,null,null,null,null,null,"］)"]
[null,null,null,null,null,null,null,null,null,null,null,null,null,null,null,"/",null,"□","：する(",null,null,null,null,null,null,null,"～",null,null,null,null,null,null,")"]
[null,null,null,null,null,null,null,null,"ゲートウェイ",null,null,null,"☑","：本ルータ",null,null,null,{"$f":"IF($M$25=\"☑\",\"□\",\"☑\")","v":"□"},"：本ルータ以外（IPアドレス=[",null,null,null,null,null,null,null,null,null,null,null,null,null,null,"］)"]
[null,null,null,null,null,null,null,null,null,null,null,null,null,null,null,"/",null,"□","：する(",null,null,null,null,null,null,null,"～",null,null,null,null,null,null,")"]
[null,null,null,null,null,null,null,null,"ゲートウェイ",null,null,null,"☑","：本ルータ",null,null,null,{"$f":"IF($M$27=\"☑\",\"□\",\"☑\")","v":"□"},"：本ルータ以外（IPアドレス=[",null,null,null,null,null,null,null,null,null,null,null,null,null,null,"］)"]
[null,null,null,null,null,null,null,null,null,null,null,null,null,null,null,"/",null,"□","：する(",null,null,null,null,null,null,null,"～",null,null,null,null,null,null,")"]
[null,null,null,null,null,null,null,null,"ゲートウェイ",null,null,null,"☑","：本ルータ",null,null,null,{"$f":"IF($M$29=\"☑\",\"□\",\"☑\")","v":"□"},"：本ルータ以外（IPアドレス=[",null,null,null,null,null,null,null,null,null,null,null,null,null,null,"］)"]
[null,null,null,null,null,null,null,null,null,null,null,null,null,null,null,"/",null,"□","：する(",null,null,null,null,null,null,null,"～",null,null,null,null,null,null,")"]
[null,null,null,null,null,null,null,null,"ゲートウェイ",null,null,null,"☑","：本ルータ",null,null,null,{"$f":"IF($M$31=\"☑\",\"□\",\"☑\")","v":"□"},"：本ルータ以外（IPアドレス=[",null,null,null,null,null,null,null,null,null,null,null,null,null,null,"］)"]
[null,null,null,null,null,null,null,null,null,null,null,null,null,null,null,"/",null,"□","：する(",null,null,null,null,null,null,null,"～",null,null,null,null,null,null,")"]
[null,null,null,null,null,null,null,null,"ゲートウェイ",null,null,null,"☑","：本ルータ",null,null,null,{"$f":"IF($M$33=\"☑\",\"□\",\"☑\")","v":"□"},"：本ルータ以外（IPアドレス=[",null,null,null,null,null,null,null,null,null,null,null,null,null,null,"］)"]
[null,null,null,null,null,null,null,null,null,null,null,null,null,null,null,"/",null,"□","：する(",null,null,null,null,null,null,null,"～",null,null,null,null,null,null,")"]
[null,null,null,null,null,null,null,null,"ゲートウェイ",null,null,null,"☑","：本ルータ",null,null,null,{"$f":"IF($M$35=\"☑\",\"□\",\"☑\")","v":"□"},"：本ルータ以外（IPアドレス=[",null,null,null,null,null,null,null,null,null,null,null,null,null,null,"］)"]
[null,null,null,null,null,null,null,null,null,null,null,null,null,null,null,"/",null,"□","：する(",null,null,null,null,null,null,null,"～",null,null,null,null,null,null,")"]
[null,null,null,null,null,null,null,null,"ゲートウェイ",null,null,null,"☑","：本ルータ",null,null,null,{"$f":"IF($M$37=\"☑\",\"□\",\"☑\")","v":"□"},"：本ルータ以外（IPアドレス=[",null,null,null,null,null,null,null,null,null,null,null,null,null,null,"］)"]
[null,null,null,null,null,null,null,null,null,null,null,null,null,null,null,"/",null,"□","：する(",null,null,null,null,null,null,null,"～",null,null,null,null,null,null,")"]
[null,null,null,null,null,null,null,null,"ゲートウェイ",null,null,null,"☑","：本ルータ",null,null,null,{"$f":"IF($M$39=\"☑\",\"□\",\"☑\")","v":"□"},"：本ルータ以外（IPアドレス=[",null,null,null,null,null,null,null,null,null,null,null,null,null,null,"］)"]
[null,null,null,null,null,null,null,null,null,null,null,null,null,null,null,"/",null,"□","：する(",null,null,null,null,null,null,null,"～",null,null,null,null,null,null,")"]
[null,null,null,null,null,null,null,null,"ゲートウェイ",null,null,null,"☑","：本ルータ",null,null,null,{"$f":"IF($M$41=\"☑\",\"□\",\"☑\")","v":"□"},"：本ルータ以外（IPアドレス=[",null,null,null,null,null,null,null,null,null,null,null,null,null,null,"］)"]
[null,null,null,null,null,null,null,null,null,null,null,null,null,null,null,"/",null,"□","：する(",null,null,null,null,null,null,null,"～",null,null,null,null,null,null,")"]
[null,null,null,null,null,null,null,null,"ゲートウェイ",null,null,null,"☑","：本ルータ",null,null,null,{"$f":"IF($M$43=\"☑\",\"□\",\"☑\")","v":"□"},"：本ルータ以外（IPアドレス=[",null,null,null,null,null,null,null,null,null,null,null,null,null,null,"］)"]
[null,null,null,null,null,null,null,null,null,null,null,null,null,null,null,"/",null,"□","：する(",null,null,null,null,null,null,null,"～",null,null,null,null,null,null,")"]
[null,null,null,null,null,null,null,null,"ゲートウェイ",null,null,null,"☑","：本ルータ",null,null,null,{"$f":"IF($M$45=\"☑\",\"□\",\"☑\")","v":"□"},"：本ルータ以外（IPアドレス=[",null,null,null,null,null,null,null,null,null,null,null,null,null,null,"］)"]
[null,null,null,null,null,null,null,null,null,null,null,null,null,null,null,"/",null,"□","：する(",null,null,null,null,null,null,null,"～",null,null,null,null,null,null,")"]
[null,null,null,null,null,null,null,null,"ゲートウェイ",null,null,null,"☑","：本ルータ",null,null,null,{"$f":"IF($M$47=\"☑\",\"□\",\"☑\")","v":"□"},"：本ルータ以外（IPアドレス=[",null,null,null,null,null,null,null,null,null,null,null,null,null,null,"］)"]
[null,"VLAN間フィルタ",null,null,null,null,"☑","：すべて許可",null,null,null,{"$f":"IF($G$48=\"☑\",\"□\",\"☑\")","v":"□"},"：すべて拒否　　※VLANごとの細かいフィルタ設定は⑨【ルーター】静的IPフィルタ設定に記載ください。"]
[]
[null,"2．LAN1インタフェースに適用追加"]
[null,"VLAN名前",null,null,null,null,"VlanID",null,"ルーターのIPアドレス/サブネット(bit)",null,null,null,null,null,null,null,null,"DHCPサーバ機能利用有無と払い出しIPアドレス範囲"]
[null,null,null,null,null,null,null,null,"DHCPサーバ利用時のゲートウェイの設定(本ルータか他の機器）"]
[null,null,null,null,null,null,null,null,null,null,null,null,null,null,null,"/",null,"□","：する(",null,null,null,null,null,null,null,"～",null,null,null,null,null,null,")"]
[null,null,null,null,null,null,null,null,"ゲートウェイ",null,null,null,"☑","：本ルータ",null,null,null,{"$f":"IF($M$54=\"☑\",\"□\",\"☑\")","v":"□"},"：本ルータ以外（IPアドレス=[",null,null,null,null,null,null,null,null,null,null,null,null,null,null,"］)"]
[null,null,null,null,null,null,null,null,null,null,null,null,null,null,null,"/",null,"□","：する(",null,null,null,null,null,null,null,"～",null,null,null,null,null,null,")"]
[null,null,null,null,null,null,null,null,"ゲートウェイ",null,null,null,"☑","：本ルータ",null,null,null,{"$f":"IF($M$56=\"☑\",\"□\",\"☑\")","v":"□"},"：本ルータ以外（IPアドレス=[",null,null,null,null,null,null,null,null,null,null,null,null,null,null,"］)"]
[null,null,null,null,null,null,null,null,null,null,null,null,null,null,null,"/",null,"□","：する(",null,null,null,null,null,null,null,"～",null,null,null,null,null,null,")"]
[null,null,null,null,null,null,null,null,"ゲートウェイ",null,null,null,"☑","：本ルータ",null,null,null,{"$f":"IF($M$58=\"☑\",\"□\",\"☑\")","v":"□"},"：本ルータ以外（IPアドレス=[",null,null,null,null,null,null,null,null,null,null,null,null,null,null,"］)"]
[null,null,null,null,null,null,null,null,null,null,null,null,null,null,null,"/",null,"□","：する(",null,null,null,null,null,null,null,"～",null,null,null,null,null,null,")"]
[null,null,null,null,null,null,null,null,"ゲートウェイ",null,null,null,"☑","：本ルータ",null,null,null,{"$f":"IF($M$60=\"☑\",\"□\",\"☑\")","v":"□"},"：本ルータ以外（IPアドレス=[",null,null,null,null,null,null,null,null,null,null,null,null,null,null,"］)"]
[null,null,null,null,null,null,null,null,null,null,null,null,null,null,null,"/",null,"□","：する(",null,null,null,null,null,null,null,"～",null,null,null,null,null,null,")"]
[null,null,null,null,null,null,null,null,"ゲートウェイ",null,null,null,"☑","：本ルータ",null,null,null,{"$f":"IF($M$62=\"☑\",\"□\",\"☑\")","v":"□"},"：本ルータ以外（IPアドレス=[",null,null,null,null,null,null,null,null,null,null,null,null,null,null,"］)"]
[null,null,null,null,null,null,null,null,null,null,null,null,null,null,null,"/",null,"□","：する(",null,null,null,null,null,null,null,"～",null,null,null,null,null,null,")"]
[null,null,null,null,null,null,null,null,"ゲートウェイ",null,null,null,"☑","：本ルータ",null,null,null,{"$f":"IF($M$64=\"☑\",\"□\",\"☑\")","v":"□"},"：本ルータ以外（IPアドレス=[",null,null,null,null,null,null,null,null,null,null,null,null,null,null,"］)"]
[null,null,null,null,null,null,null,null,null,null,null,null,null,null,null,"/",null,"□","：する(",null,null,null,null,null,null,null,"～",null,null,null,null,null,null,")"]
[null,null,null,null,null,null,null,null,"ゲートウェイ",null,null,null,"☑","：本ルータ",null,null,null,{"$f":"IF($M$66=\"☑\",\"□\",\"☑\")","v":"□"},"：本ルータ以外（IPアドレス=[",null,null,null,null,null,null,null,null,null,null,null,null,null,null,"］)"]
[null,null,null,null,null,null,null,null,null,null,null,null,null,null,null,"/",null,"□","：する(",null,null,null,null,null,null,null,"～",null,null,null,null,null,null,")"]
[null,null,null,null,null,null,null,null,"ゲートウェイ",null,null,null,"☑","：本ルータ",null,null,null,{"$f":"IF($M$68=\"☑\",\"□\",\"☑\")","v":"□"},"：本ルータ以外（IPアドレス=[",null,null,null,null,null,null,null,null,null,null,null,null,null,null,"］)"]
[null,null,null,null,null,null,null,null,null,null,null,null,null,null,null,"/",null,"□","：する(",null,null,null,null,null,null,null,"～",null,null,null,null,null,null,")"]
[null,null,null,null,null,null,null,null,"ゲートウェイ",null,null,null,"☑","：本ルータ",null,null,null,{"$f":"IF($M$70=\"☑\",\"□\",\"☑\")","v":"□"},"：本ルータ以外（IPアドレス=[",null,null,null,null,null,null,null,null,null,null,null,null,null,null,"］)"]
[null,null,null,null,null,null,null,null,null,null,null,null,null,null,null,"/",null,"□","：する(",null,null,null,null,null,null,null,"～",null,null,null,null,null,null,")"]
[null,null,null,null,null,null,null,null,"ゲートウェイ",null,null,null,"☑","：本ルータ",null,null,null,{"$f":"IF($M$72=\"☑\",\"□\",\"☑\")","v":"□"},"：本ルータ以外（IPアドレス=[",null,null,null,null,null,null,null,null,null,null,null,null,null,null,"］)"]
[null,null,null,null,null,null,null,null,null,null,null,null,null,null,null,"/",null,"□","：する(",null,null,null,null,null,null,null,"～",null,null,null,null,null,null,")"]
[null,null,null,null,null,null,null,null,"ゲートウェイ",null,null,null,"☑","：本ルータ",null,null,null,{"$f":"IF($M$74=\"☑\",\"□\",\"☑\")","v":"□"},"：本ルータ以外（IPアドレス=[",null,null,null,null,null,null,null,null,null,null,null,null,null,null,"］)"]
[null,null,null,null,null,null,null,null,null,null,null,null,null,null,null,"/",null,"□","：する(",null,null,null,null,null,null,null,"～",null,null,null,null,null,null,")"]
[null,null,null,null,null,null,null,null,"ゲートウェイ",null,null,null,"☑","：本ルータ",null,null,null,{"$f":"IF($M$76=\"☑\",\"□\",\"☑\")","v":"□"},"：本ルータ以外（IPアドレス=[",null,null,null,null,null,null,null,null,null,null,null,null,null,null,"］)"]
[null,null,null,null,null,null,null,null,null,null,null,null,null,null,null,"/",null,"□","：する(",null,null,null,null,null,null,null,"～",null,null,null,null,null,null,")"]
[null,null,null,null,null,null,null,null,"ゲートウェイ",null,null,null,"☑","：本ルータ",null,null,null,{"$f":"IF($M$78=\"☑\",\"□\",\"☑\")","v":"□"},"：本ルータ以外（IPアドレス=[",null,null,null,null,null,null,null,null,null,null,null,null,null,null,"］)"]
[null,null,null,null,null,null,null,null,null,null,null,null,null,null,null,"/",null,"□","：する(",null,null,null,null,null,null,null,"～",null,null,null,null,null,null,")"]
[null,null,null,null,null,null,null,null,"ゲートウェイ",null,null,null,"☑","：本ルータ",null,null,null,{"$f":"IF($M$80=\"☑\",\"□\",\"☑\")","v":"□"},"：本ルータ以外（IPアドレス=[",null,null,null,null,null,null,null,null,null,null,null,null,null,null,"］)"]
[null,null,null,null,null,null,null,null,null,null,null,null,null,null,null,"/",null,"□","：する(",null,null,null,null,null,null,null,"～",null,null,null,null,null,null,")"]
[null,null,null,null,null,null,null,null,"ゲートウェイ",null,null,null,"☑","：本ルータ",null,null,null,{"$f":"IF($M$82=\"☑\",\"□\",\"☑\")","v":"□"},"：本ルータ以外（IPアドレス=[",null,null,null,null,null,null,null,null,null,null,null,null,null,null,"］)"]
[null,null,null,null,null,null,null,null,null,null,null,null,null,null,null,"/",null,"□","：する(",null,null,null,null,null,null,null,"～",null,null,null,null,null,null,")"]
[null,null,null,null,null,null,null,null,"ゲートウェイ",null,null,null,"☑","：本ルータ",null,null,null,{"$f":"IF($M$84=\"☑\",\"□\",\"☑\")","v":"□"},"：本ルータ以外（IPアドレス=[",null,null,null,null,null,null,null,null,null,null,null,null,null,null,"］)"]
[null,"VLAN間フィルタ",null,null,null,null,"☑","：すべて許可",null,null,null,{"$f":"IF($G$48=\"☑\",\"□\",\"☑\")","v":"□"},"：すべて拒否　　※VLANごとの細かいフィルタ設定は⑨【ルーター】静的IPフィルタ設定に記載ください。"]
[]
[]
[]
[null,"■オプション"]
[null,"1. 標準リース時間の変更　\n　　クライアントに割り当てるデフォルトのリース時は、72時間です。変更したい場合は、ここでVLAN名を指定して変更後のリース\n　　時間を記入します。なお、無制限を指定したい場合は、”0”時間”0”分と入力してください。"]
[]
[]
[null,null,"VLAN名",null,null,null,null,"標準リース時間",null,null,null,null,null,null,null,"VLAN名",null,null,null,null,"標準リース時間"]
[null,null,null,null,null,null,null,null,null,"時間",null,null,null,"分",null,null,null,null,null,null,null,null,"時間",null,null,null,"分"]
[null,null,null,null,null,null,null,null,null,"時間",null,null,null,"分",null,null,null,null,null,null,null,null,"時間",null,null,null,"分"]
[null,null,null,null,null,null,null,null,null,"時間",null,null,null,"分",null,null,null,null,null,null,null,null,"時間",null,null,null,"分"]
[null,null,null,null,null,null,null,null,null,"時間",null,null,null,"分",null,null,null,null,null,null,null,null,"時間",null,null,null,"分"]
[null,null,null,null,null,null,null,null,null,"時間",null,null,null,"分",null,null,null,null,null,null,null,null,"時間",null,null,null,"分"]
[null,null,null,null,null,null,null,null,null,"時間",null,null,null,"分",null,null,null,null,null,null,null,null,"時間",null,null,null,"分"]
[null,null,null,null,null,null,null,null,null,"時間",null,null,null,"分",null,null,null,null,null,null,null,null,"時間",null,null,null,"分"]
[null,null,null,null,null,null,null,null,null,"時間",null,null,null,"分",null,null,null,null,null,null,null,null,"時間",null,null,null,"分"]
[null,null,null,null,null,null,null,null,null,"時間",null,null,null,"分",null,null,null,null,null,null,null,null,"時間",null,null,null,"分"]
[null,null,null,null,null,null,null,null,null,"時間",null,null,null,"分",null,null,null,null,null,null,null,null,"時間",null,null,null,"分"]
[null,null,null,null,null,null,null,null,null,"時間",null,null,null,"分",null,null,null,null,null,null,null,null,"時間",null,null,null,"分"]
[null,null,null,null,null,null,null,null,null,"時間",null,null,null,"分",null,null,null,null,null,null,null,null,"時間",null,null,null,"分"]
[null,null,null,null,null,null,null,null,null,"時間",null,null,null,"分",null,null,null,null,null,null,null,null,"時間",null,null,null,"分"]
[null,null,null,null,null,null,null,null,null,"時間",null,null,null,"分",null,null,null,null,null,null,null,null,"時間",null,null,null,"分"]
[null,null,null,null,null,null,null,null,null,"時間",null,null,null,"分",null,null,null,null,null,null,null,null,"時間",null,null,null,"分"]
[null,null,null,null,null,null,null,null,null,"時間",null,null,null,"分",null,null,null,null,null,null,null,null,"時間",null,null,null,"分"]
[]
[null,"2. DHCPサーバの同一セグメント内での割り当て範囲の追加　\n　　同一セグメント内で複数のIPアドレス払い出し範囲が必要な場合に、VLAN名と割り当て範囲を記入します。"]
[]
[]
[null,null,"VLAN名",null,null,null,null,"追加する割り当て範囲"]
[null,null,null,null,null,null,null,null,null,null,null,null,null,null,"(～)",null,null,null,null,null,null,null,"行数が足りない場合は、行挿入にてご利用ください。"]
[null,null,null,null,null,null,null,null,null,null,null,null,null,null,"(～)"]
[null,null,null,null,null,null,null,null,null,null,null,null,null,null,"(～)"]
[null,null,null,null,null,null,null,null,null,null,null,null,null,null,"(～)"]
[null,null,null,null,null,null,null,null,null,null,null,null,null,null,"(～)"]
[null,null,null,null,null,null,null,null,null,null,null,null,null,null,"(～)"]
[null,null,null,null,null,null,null,null,null,null,null,null,null,null,"(～)"]
[null,null,null,null,null,null,null,null,null,null,null,null,null,null,"(～)"]
[null,null,null,null,null,null,null,null,null,null,null,null,null,null,"(～)"]
[null,null,null,null,null,null,null,null,null,null,null,null,null,null,"(～)"]
[null,null,null,null,null,null,null,null,null,null,null,null,null,null,"(～)"]
[null,null,null,null,null,null,null,null,null,null,null,null,null,null,"(～)"]
[null,null,null,null,null,null,null,null,null,null,null,null,null,null,"(～)"]
[null,null,null,null,null,null,null,null,null,null,null,null,null,null,"(～)"]
[null,null,null,null,null,null,null,null,null,null,null,null,null,null,"(～)"]
[null,null,null,null,null,null,null,null,null,null,null,null,null,null,"(～)"]

{"sheet":"⑤【ルーター】拠点間IPSec接続先","index":12,"n_rows":76,"n_cols":13,"rows_kept":76,"cut":false,"hidden":false,"merged":[[20,8,20,11],[45,8,45,11],[1,1,1,12],[17,1,18,12]]}
[]
[null,"【ルーター】拠点間（IPSec/メインモード）接続先 "]
[]
[]
[null,"◆本社イメージ例"]
[null,null,null,"(固定)　　",null,"　(固定)"]
[]
[]
[]
[]
[]
[null,"◆拠点イメージ例"]
[null,null,null,"(固定)　　",null,"　(固定)"]
[]
[]
[]
[]
[null,"※予めデフォルト設定している項目があります。それら設定がお客様ご運用において正しいかを必ずご確認のうえ、本設定シートを作成してください。なお、本シートに記載できない内容はサービス提供範囲外となります。"]
[]
[]
[null,"TUNNEL\nNo.","①接続先事業所名","②接続先WAN\nアドレス","事前共有鍵","認証\nアルゴリズム","暗号\nアルゴリズム","③通信先ネットワーク\nやホストアドレス","④デフォルト経路の利用有無\n　※本経路利用時、③の設定\n　　がなくてもよい",null,null,null,"⑤その他の通信先アドレス\n　例) 192.168.10.0/24,\n   　  192.168.11.100/32"]
[null,"例","西日本事業所","xxx.xxx.xxx.1","yamaha01","HMAC-SHA256","AES256-CBC","192.168.1.0/24","□","：する",{"$f":"IF($I$22=\"☑\",\"□\",\"☑\")","v":"☑"},"：しない","192.168.10.0/24"]
[null,"例","本社","xxx.xxx.xxx.2","yamaha01","HMAC-SHA256","AES256-CBC",null,"☑","：する",{"$f":"IF($I$23=\"☑\",\"□\",\"☑\")","v":"□"},"：しない"]
[null,1,null,null,null,null,null,null,"□","：する",{"$f":"IF($I$24=\"☑\",\"□\",\"☑\")","v":"☑"},"：しない"]
[null,2,null,null,null,null,null,null,"□","：する",{"$f":"IF($I$25=\"☑\",\"□\",\"☑\")","v":"☑"},"：しない"]
[null,3,null,null,null,null,null,null,"□","：する",{"$f":"IF($I$26=\"☑\",\"□\",\"☑\")","v":"☑"},"：しない"]
[null,4,null,null,null,null,null,null,"□","：する",{"$f":"IF($I$27=\"☑\",\"□\",\"☑\")","v":"☑"},"：しない"]
[null,5,null,null,null,null,null,null,"□","：する",{"$f":"IF($I$28=\"☑\",\"□\",\"☑\")","v":"☑"},"：しない"]
[null,6,null,null,null,null,null,null,"□","：する",{"$f":"IF($I$29=\"☑\",\"□\",\"☑\")","v":"☑"},"：しない"]
[null,7,null,null,null,null,null,null,"□","：する",{"$f":"IF($I$30=\"☑\",\"□\",\"☑\")","v":"☑"},"：しない"]
[null,8,null,null,null,null,null,null,"□","：する",{"$f":"IF($I$31=\"☑\",\"□\",\"☑\")","v":"☑"},"：しない"]
[null,9,null,null,null,null,null,null,"□","：する",{"$f":"IF($I$32=\"☑\",\"□\",\"☑\")","v":"☑"},"：しない"]
[null,10,null,null,null,null,null,null,"□","：する",{"$f":"IF($I$33=\"☑\",\"□\",\"☑\")","v":"☑"},"：しない"]
[null,11,null,null,null,null,null,null,"□","：する",{"$f":"IF($I$34=\"☑\",\"□\",\"☑\")","v":"☑"},"：しない"]
[null,12,null,null,null,null,null,null,"□","：する",{"$f":"IF($I$35=\"☑\",\"□\",\"☑\")","v":"☑"},"：しない"]
[null,13,null,null,null,null,null,null,"□","：する",{"$f":"IF($I$36=\"☑\",\"□\",\"☑\")","v":"☑"},"：しない"]
[null,14,null,null,null,null,null,null,"□","：する",{"$f":"IF($I$37=\"☑\",\"□\",\"☑\")","v":"☑"},"：しない"]
[null,15,null,null,null,null,null,null,"□","：する",{"$f":"IF($I$38=\"☑\",\"□\",\"☑\")","v":"☑"},"：しない"]
[null,16,null,null,null,null,null,null,"□","：する",{"$f":"IF($I$39=\"☑\",\"□\",\"☑\")","v":"☑"},"：しない"]
[null,17,null,null,null,null,null,null,"□","：する",{"$f":"IF($I$40=\"☑\",\"□\",\"☑\")","v":"☑"},"：しない"]
[null,18,null,null,null,null,null,null,"□","：する",{"$f":"IF($I$41=\"☑\",\"□\",\"☑\")","v":"☑"},"：しない"]
[null,19,null,null,null,null,null,null,"□","：する",{"$f":"IF($I$42=\"☑\",\"□\",\"☑\")","v":"☑"},"：しない"]
[null,20,null,null,null,null,null,null,"□","：する",{"$f":"IF($I$43=\"☑\",\"□\",\"☑\")","v":"☑"},"：しない"]
[]
[]
[null,"TUNNEL\nNo.","①接続先事業所名","②接続先WANアドレス","事前共有鍵","認証\nアルゴリズム","暗号\nアルゴリズム","③通信先ネットワーク\nやホストアドレス","④デフォルト経路の利用有無\n　※本経路利用時、③の設定\n　　がなくてもよい",null,null,null,"⑤その他の通信先アドレス\n　例) 192.168.10.0/24,\n   　  192.168.11.100/32"]
[null,21,null,null,null,null,null,null,"□","：する",{"$f":"IF($I$47=\"☑\",\"□\",\"☑\")","v":"☑"},"：しない"]
[null,22,null,null,null,null,null,null,"□","：する",{"$f":"IF($I$48=\"☑\",\"□\",\"☑\")","v":"☑"},"：しない"]
[null,23,null,null,null,null,null,null,"□","：する",{"$f":"IF($I$49=\"☑\",\"□\",\"☑\")","v":"☑"},"：しない"]
[null,24,null,null,null,null,null,null,"□","：する",{"$f":"IF($I$50=\"☑\",\"□\",\"☑\")","v":"☑"},"：しない"]
[null,25,null,null,null,null,null,null,"□","：する",{"$f":"IF($I$51=\"☑\",\"□\",\"☑\")","v":"☑"},"：しない"]
[null,26,null,null,null,null,null,null,"□","：する",{"$f":"IF($I$52=\"☑\",\"□\",\"☑\")","v":"☑"},"：しない"]
[null,27,null,null,null,null,null,null,"□","：する",{"$f":"IF($I$53=\"☑\",\"□\",\"☑\")","v":"☑"},"：しない"]
[null,28,null,null,null,null,null,null,"□","：する",{"$f":"IF($I$54=\"☑\",\"□\",\"☑\")","v":"☑"},"：しない"]
[null,29,null,null,null,null,null,null,"□","：する",{"$f":"IF($I$55=\"☑\",\"□\",\"☑\")","v":"☑"},"：しない"]
[null,30,null,null,null,null,null,null,"□","：する",{"$f":"IF($I$56=\"☑\",\"□\",\"☑\")","v":"☑"},"：しない"]
[null,31,null,null,null,null,null,null,"□","：する",{"$f":"IF($I$57=\"☑\",\"□\",\"☑\")","v":"☑"},"：しない"]
[null,32,null,null,null,null,null,null,"□","：する",{"$f":"IF($I$58=\"☑\",\"□\",\"☑\")","v":"☑"},"：しない"]
[null,33,null,null,null,null,null,null,"□","：する",{"$f":"IF($I$59=\"☑\",\"□\",\"☑\")","v":"☑"},"：しない"]
[null,34,null,null,null,null,null,null,"□","：する",{"$f":"IF($I$60=\"☑\",\"□\",\"☑\")","v":"☑"},"：しない"]
[null,35,null,null,null,null,null,null,"□","：する",{"$f":"IF($I$61=\"☑\",\"□\",\"☑\")","v":"☑"},"：しない"]
[null,36,null,null,null,null,null,null,"□","：する",{"$f":"IF($I$62=\"☑\",\"□\",\"☑\")","v":"☑"},"：しない"]
[null,37,null,null,null,null,null,null,"□","：する",{"$f":"IF($I$63=\"☑\",\"□\",\"☑\")","v":"☑"},"：しない"]
[null,38,null,null,null,null,null,null,"□","：する",{"$f":"IF($I$64=\"☑\",\"□\",\"☑\")","v":"☑"},"：しない"]
[null,39,null,null,null,null,null,null,"□","：する",{"$f":"IF($I$65=\"☑\",\"□\",\"☑\")","v":"☑"},"：しない"]
[null,40,null,null,null,null,null,null,"□","：する",{"$f":"IF($I$66=\"☑\",\"□\",\"☑\")","v":"☑"},"：しない"]
[null,41,null,null,null,null,null,null,"□","：する",{"$f":"IF($I$67=\"☑\",\"□\",\"☑\")","v":"☑"},"：しない"]
[null,42,null,null,null,null,null,null,"□","：する",{"$f":"IF($I$68=\"☑\",\"□\",\"☑\")","v":"☑"},"：しない"]
[null,43,null,null,null,null,null,null,"□","：する",{"$f":"IF($I$69=\"☑\",\"□\",\"☑\")","v":"☑"},"：しない"]
[null,44,null,null,null,null,null,null,"□","：する",{"$f":"IF($I$70=\"☑\",\"□\",\"☑\")","v":"☑"},"：しない"]
[null,45,null,null,null,null,null,null,"□","：する",{"$f":"IF($I$71=\"☑\",\"□\",\"☑\")","v":"☑"},"：しない"]
[null,46,null,null,null,null,null,null,"□","：する",{"$f":"IF($I$72=\"☑\",\"□\",\"☑\")","v":"☑"},"：しない"]
[null,47,null,null,null,null,null,null,"□","：する",{"$f":"IF($I$73=\"☑\",\"□\",\"☑\")","v":"☑"},"：しない"]
[null,48,null,null,null,null,null,null,"□","：する",{"$f":"IF($I$74=\"☑\",\"□\",\"☑\")","v":"☑"},"：しない"]
[null,49,null,null,null,null,null,null,"□","：する",{"$f":"IF($I$75=\"☑\",\"□\",\"☑\")","v":"☑"},"：しない"]
[null,50,null,null,null,null,null,null,"□","：する",{"$f":"IF($I$76=\"☑\",\"□\",\"☑\")","v":"☑"},"：しない"]

{"sheet":"⑥【ルーター】リモートアクセス接続先","index":13,"n_rows":120,"n_cols":18,"rows_kept":120,"cut":false,"hidden":false,"merged":[[120,1,120,19],[15,8,15,12],[1,1,1,21],[12,1,13,23],[10,1,11,23],[14,8,14,12],[19,3,19,14],[14,3,14,7],[15,3,15,7],[14,13,14,19],[15,13,15,19],[16,1,16,19]]}
[]
[null,"【ルーター】リモートアクセス（L2TP/IPSec）接続先　"]
[]
[]
[null,"◆本社イメージ例"]
[null,null,null,null,null,null,null,"(固定)"]
[]
[]
[]
[]
[null,"※予めデフォルト設定している項目があります。それら設定がお客様ご運用において正しいかを必ずご確認のうえ、本設定シートを作成してください。なお、本シートに記載できない内容はサービス提供範囲外となります。"]
[]
[null,"※本機能を利用する場合、LAN1インタフェースにてDHCPサーバの設定が必要です。\nまた割り当て範囲にもここで接続するユーザ数分の考慮も必要です。"]
[]
[null,"接続端末数\n(ユーザ登録数)(※1)","事前共有鍵\n(英数字半角32文字まで)","認証アルゴリズム\n(※2)",null,null,null,null,"暗号アルゴリズム\n(※3)",null,null,null,null,"①自分側WANアドレス(※4)"]
[]
[null,"※1､下記の登録したユーザ名の合計数と合わせてください。\n※2､HMAC-SHA256：Windows端末(YMS-VPN8)では利用不可、iPhone端末ではiOSに依存する可能性あり。\n　　　HMAC-SHA384、HMAC-SHA512：Windows端末(YMS-VPN8)、iPhone端末ともに利用不可。\n　　　両端末混在時は、HMAC-SHA選択を推奨。\n※3､AES256-CBC：Windows端末(YMS-VPN8)では利用不可、iPhone端末では可能を確認。\n　　   3DES-CBC、DES-CBC：Windows端末(YMS-VPN8)、iPhone端末ともに利用不可。\n          両端末混在時は、AES-CBC選択を推奨。\n※4､必須記入ではありません。本シートを参照するだけで端末側設定時のパラメータがわかるように項目を用意しています。"]
[]
[null,"ユーザ認証",null,"☑","：MS-CHAPv2",null,null,null,"□","：MS-CHAP",null,null,null,"□","：PAP",null,"□","：CHAP"]
[null,"ユーザ名","パスワード","メモ欄（ルータ設定には利用しません）"]
[1]
[2]
[3]
[4]
[5]
[6]
[7]
[8]
[9]
[10]
[11]
[12]
[13]
[14]
[15]
[16]
[17]
[18]
[19]
[20]
[21]
[22]
[23]
[24]
[25]
[26]
[27]
[28]
[29]
[30]
[31]
[32]
[33]
[34]
[35]
[36]
[37]
[38]
[39]
[40]
[41]
[42]
[43]
[44]
[45]
[46]
[47]
[48]
[49]
[50]
[51]
[52]
[53]
[54]
[55]
[56]
[57]
[58]
[59]
[60]
[61]
[62]
[63]
[64]
[65]
[66]
[67]
[68]
[69]
[70]
[71]
[72]
[73]
[74]
[75]
[76]
[77]
[78]
[79]
[80]
[81]
[82]
[83]
[84]
[85]
[86]
[87]
[88]
[89]
[90]
[91]
[92]
[93]
[94]
[95]
[96]
[97]
[98]
[99]
[100]

{"sheet":"⑦【ルーター】カメラや公開サーバ設定","index":14,"n_rows":54,"n_cols":16,"rows_kept":54,"cut":false,"hidden":false,"merged":[[1,1,1,22],[7,2,7,3],[7,8,7,11],[9,1,10,22],[19,3,19,8],[19,9,19,14],[19,15,19,22],[12,1,13,4],[17,3,17,8],[17,9,17,14],[17,15,17,22],[18,3,18,8],[18,9,18,14],[18,15,18,22],[22,3,22,8],[22,9,22,14],[22,15,22,22],[23,3,23,8],[23,9,23,14],[23,15,23,22],[28,3,28,8],[28,9,28,14],[28,15,28,22],[24,3,24,8],[24,9,24,14],[24,15,24,22],[25,3,25,8],[25,9,25,14],[25,15,25,22],[26,3,26,8],[26,9,26,14],[26,15,26,22],[27,3,27,8],[27,9,27,14],[27,15,27,22],[31,3,31,5],[31,6,31,7],[31,8,31,14],[31,15,31,22],[32,3,32,5],[32,6,32,7],[32,8,32,14],[32,15,32,22],[33,3,33,5],[33,6,33,7],[33,8,33,14],[33,15,33,22],[34,3,34,5],[34,6,34,7],[34,8,34,14],[34,15,34,22],[35,3,35,5],[35,6,35,7],[35,8,35,14],[35,15,35,22],[36,3,36,5],[36,6,36,7],[36,8,36,14],[36,15,36,22],[43,3,43,5],[43,6,43,7],[43,8,43,14],[43,15,43,22],[42,3,42,5],[42,6,42,7],[42,8,42,14],[42,15,42,22],[39,3,39,5],[39,6,39,7],[39,8,39,14],[39,15,39,22],[37,3,37,5],[37,6,37,7],[37,8,37,14],[37,15,37,22],[38,3,38,5],[38,6,38,7],[38,8,38,14],[38,15,38,22],[41,3,41,5],[41,6,41,7],[41,8,41,14],[41,15,41,22],[40,3,40,5],[40,6,40,7],[40,8,40,14],[40,15,40,22],[20,3,20,8],[20,9,20,14],[20,15,20,22],[21,3,21,8],[21,9,21,14],[21,15,21,22]]}
[]
[null,"【ルーター】カメラや公開サーバ設定  "]
[]
[null,"◆イメージ例"]
[null,null,null,null,null,null,null,"LAN1 ",null,null,null,null,"WAN(PPPoE)"]
[]
[null,null,null,null,null,null,null,null,null,null,null,null,"xxx.xxx.xxx.1/32"]
[null,null,"カメラ",null,null,null,null,null,"(静的IPマスカレード)",null,null,null,"←","http://xxx.xxx.xxx.1"]
[null,"http://192.168.0.100"]
[null,"※予めデフォルト設定している項目があります。それら設定がお客様ご運用において正しいかを必ずご確認のうえ、本設定シートを作成してください。なお、本シートに記載できない内容はサービス提供範囲外となります。"]
[]
[null,"■NAT（変換前のグローバルIPアドレスでアクセスし、変換後のプライベトIPアドレスでカメラや公開サーバにアクセス。)"]
[null,"方向\n(いずれかを選択)",null,null,null,"☑","：WAN（インターネット）側　→　LAN1"]
[null,null,null,null,null,{"$f":"IF($F$13=\"☑\",\"□\",\"☑\")","v":"□"},"：WAN（インターネット）側　→　LAN2（RTXハイエンド/ハイエンド10GタイプYのみ）"]
[null,"種別と変換内容（必要時、行挿入してご利用ください。）"]
[null,null,"□","：静的NAT（グローバルIPアドレス--(変換)-->プライベートIPアドレス）"]
[null,null,null,"変換前グローバルIPアドレス",null,null,null,null,null,"変換後プライベートIPアドレス",null,null,null,null,null,"送信元IPアドレス(IPフィルタで使用）"]
[null,null,null," ",null,null,null,null,null," "]
[null,null,null," "]
[]
[null,null,null," "]
[null,null,null,null,null,null,null,null,null," "]
[]
[]
[null,null,null,null,null,null,null,null,null,null,null,null,null,null,null," "]
[]
[null,null,null,null,null,null,null,null,null," "]
[null,null,null," "]
[null,null,null,null,null,null,null,null,null," "]
[null,null,"□","：静的IPマスカレード（グローバルIPアドレス/プロトコル/(ポート)--(変換)-->プライベートIPアドレス）"]
[null,null,null,"プロトコル",null,null,"ポート",null,"変換後IPアドレス",null,null,null,null,null,null,"送信元IPアドレス(IPフィルタで使用)"]
[null,null,"例)","tcp",null,null,80,null,"192.168.0.100",null,null,null,null,null,null,"*(すべて)"]
[null,null,null," "]
[]
[]
[]
[]
[null,null,null,null,null,null,null,null," ",null,null,null,null,null,null," "]
[null,null,null," "]
[]
[]
[]
[]
[]
[]
[null,"■IPフィルタ"]
[null,"☑","：NAT設定をもとに、受信方向(WAN→LAN)に対して本サービス側で設定を追加する。"]
[null,null,"TCP",null,"☑","動的IPフィルタを追加する。"]
[null,null,null,null,null,"☑","最初のパケット(SYN)だけを通す静的IPフィルタと併用する。"]
[null,null,null,null,null,{"$f":"IF($F$49=\"☑\",\"□\",\"☑\")","v":"□"},"該当するパケットを通す静的IPフィルタと併用する。"]
[null,null,null,null,{"$f":"IF($E$48=\"☑\",\"□\",\"☑\")","v":"□"},"静的IPフィルタを追加する。"]
[null,null,"UDP",null,"☑","動的IPフィルタを追加する。該当するパケットを通す静的IPフィルタと併用する。"]
[null,null,null,null,{"$f":"IF($E$52=\"☑\",\"□\",\"☑\")","v":"□"},"静的IPフィルタを追加する。"]
[null,{"$f":"IF($B$47=\"☑\",\"□\",\"☑\")","v":"□"},"：追加しない。"]

{"sheet":"⑧【ルーター】経路設定","index":15,"n_rows":52,"n_cols":6,"rows_kept":52,"cut":false,"hidden":false,"merged":[[1,1,1,5],[4,1,4,5]]}
[]
[null,"【ルーター】経路設定 "]
[]
[]
[null,"※設定例を参考に、本設定シートを作成してください。なお、本シートに記載できない内容はサービス提供範囲外となります。"]
[null,null,"宛先ネットワーク","ゲートウェイ","IPアドレス/相手先番号","説明"]
[null,"例","デフォルト(default)","LAN/VLAN","192.168.100.100","デフォルトゲートウェイを　192.168.100.100 に設定する。"]
[null,"例","192.168.101.1/32","PP(相手先番号)",2,"IPSec接続時の接続先のWANアドレスへのゲートウェイをPP[2]に設定する。PP[2]とは、「【ルーター】回線プロバイダ設定」シートの\"3．フレッツVPNワイド設定情報 < 2．プロバイダー設定がある場合はPP[2]、ない場合はPP[1] >\" のPP[2]を示す。"]
[null,"例","192.168.200.0/24","LAN/VLAN","192.168.100.101","192.168.200.0/24あてのゲートウェイを 192.168.100.101 に設定する。"]
[null,"例","192.168.201.0/24","TUNNEL(相手先番号)",1,"192.168.201.0/24あてのゲートウェイを TUNNEL[1] に設定する。TUNNEL[1] とは、「【ルーター】拠点間IPSec接続先」シートのTUNNEL NO.を示す。"]
[null,null,null,null,null,"行数が足りない場合、行挿入してご利用ください。"]
[null,null,"宛先ネットワーク","ゲートウェイ","IPアドレス/相手先番号"]
[null,1]
[null,2]
[null,3]
[null,4]
[null,5]
[null,6]
[null,7]
[null,8]
[null,9]
[null,10]
[null,11]
[null,12]
[null,13]
[null,14]
[null,15]
[null,16]
[null,17]
[null,18]
[null,19]
[null,20]
[null,21]
[null,22]
[null,23]
[null,24]
[null,25]
[null,26]
[null,27]
[null,28]
[null,29]
[null,30]
[null,31]
[null,32]
[null,33]
[null,34]
[null,35]
[null,36]
[null,37]
[null,38]
[null,39]
[null,40]

{"sheet":"⑨【ルーター】静的IPフィルタ設定","index":16,"n_rows":49,"n_cols":12,"rows_kept":49,"cut":false,"hidden":false,"merged":[[48,2,50,11],[48,1,50,1],[19,1,19,11],[12,10,12,11],[12,1,13,1],[12,2,12,5],[12,6,13,6],[12,7,12,8],[12,9,13,9],[1,1,1,11],[20,1,21,1],[20,2,20,5],[20,6,21,6],[20,7,20,8],[20,9,21,9],[20,10,20,11],[11,1,11,11]]}
[]
[null,"【ルーター】静的IPフィルタ設定 "]
[]
[]
[null,"◆イメージ例"]
[null,null,"LAN1",null,null,null,null,"PP[1]"]
[]
[]
[]
[null,null,null,null,null,null,null,"Tunnel[1]"]
[]
[null,"※設定例を参考に、本設定シートを作成してください。なお、本シートに記載できない内容はサービス提供範囲外となります。"]
[null,"No.","適用",null,null,null,"タイプ","送信元",null,"プロトコル","宛先"]
[null,null,"インターフェース\nor接続先名","相手先番号","入","出",null,"IPアドレス","ポート",null,"IPアドレス","ポート"]
[null,"例","PP(相手先番号)",1,null,"☑","reject","192.168.0.0/24","*","TCP","(グローバルアドレス)",23]
[null,"例","LAN1",null,"☑",null,"pass","192.168.10.0/24","*","ICMP","*","*"]
[null,"例","TUNNEL(相手先番号)",1,null,"☑","pass","192.168.0.100","*","TCP","192.168.1.1",22]
[null,"例","特定セグメント",null,null,null,"reject","192.168.20.0/24"]
[]
[null,"※インターフェース（相手先番号）単位にNo.の昇順にIPフィルタの検査を行います。\n※行数が足りない場合、行挿入してご利用ください。\n"]
[null,"No.","適用",null,null,null,"タイプ","送信元",null,"プロトコル","宛先"]
[null,null,"インターフェース\nor接続先名","相手先番号","入","出",null,"IPアドレス","ポート",null,"IPアドレス","ポート"]
[null,1]
[null,2]
[null,3]
[null,4]
[null,5]
[null,6]
[null,7]
[null,8]
[null,9]
[null,10]
[null,11]
[null,12]
[null,13]
[null,14]
[null,15]
[null,16]
[null,17]
[null,18]
[null,19]
[null,20]
[null,21]
[null,22]
[null,23]
[null,24]
[null,25]
[null,26]
[null,"備考"]

{"sheet":"⑩【ルーター】NAT設定","index":17,"n_rows":79,"n_cols":27,"rows_kept":79,"cut":false,"hidden":false,"merged":[[84,7,84,12],[84,13,84,18],[72,18,72,20],[49,17,49,19],[69,18,69,20],[69,15,69,17],[72,15,72,17],[50,17,50,19],[78,8,78,12],[79,13,79,18],[78,13,78,18],[78,19,78,21],[79,19,79,21],[79,7,79,12],[87,19,87,21],[86,19,86,21],[85,19,85,21],[82,19,82,21],[81,19,81,21],[80,19,80,21],[83,19,83,21],[84,19,84,21],[71,4,71,6],[71,7,71,9],[87,7,87,12],[86,7,86,12],[85,7,85,12],[82,7,82,12],[81,7,81,12],[80,7,80,12],[87,13,87,18],[86,13,86,18],[85,13,85,18],[82,13,82,18],[81,13,81,18],[80,13,80,18],[83,7,83,12],[83,13,83,18],[66,4,66,6],[69,4,69,6],[36,20,36,22],[37,20,37,22],[40,15,40,17],[39,15,39,17],[39,20,39,22],[40,20,40,22],[39,2,39,4],[40,2,40,4],[36,7,36,9],[37,7,37,9],[39,7,39,9],[40,7,40,9],[54,2,54,26],[50,7,50,12],[68,4,68,6],[68,7,68,9],[68,15,68,17],[68,18,68,20],[65,15,65,17],[65,18,65,20],[39,23,40,26],[39,5,39,6],[17,2,17,4],[18,2,18,4],[17,7,17,9],[18,7,18,9],[17,15,17,17],[18,15,18,17],[17,20,17,22],[18,20,18,22],[36,2,36,4],[39,12,40,12],[39,18,39,19],[77,7,77,12],[77,13,77,18],[77,19,77,21],[72,4,72,6],[66,7,66,9],[69,7,69,9],[72,7,72,9],[77,2,87,6],[75,2,75,6],[76,2,76,6],[76,7,76,9],[65,12,66,12],[65,21,66,26],[78,22,87,26],[68,12,69,12],[71,12,72,12],[71,21,72,26],[71,15,71,17],[71,18,71,20],[47,7,47,12],[47,13,47,16],[46,2,51,6],[48,7,48,12],[48,13,48,16],[48,17,48,19],[49,7,49,12],[49,13,49,16],[50,13,50,16],[65,4,65,6],[62,12,63,12],[47,17,47,19],[37,2,37,4],[40,5,40,6],[40,18,40,19],[42,2,42,6],[43,2,43,6],[9,2,9,26],[28,2,28,26],[65,7,65,9],[66,15,66,17],[66,18,66,20],[43,7,43,9],[63,4,63,6],[62,7,62,9],[63,7,63,9],[62,15,62,17],[62,18,62,20],[63,15,63,17],[63,18,63,20],[62,4,62,6],[46,7,46,12],[46,13,46,16],[46,17,46,19],[44,2,45,6],[45,13,45,25],[1,1,1,26],[24,2,25,6],[21,7,21,9],[22,2,23,6],[23,13,23,25],[20,2,20,6],[25,14,25,25],[21,2,21,6],[51,7,51,12],[51,13,51,16],[51,17,51,19],[3,1,4,26],[17,12,18,12],[17,5,17,6],[18,5,18,6],[17,18,17,19],[18,18,18,19],[36,5,36,6],[36,12,37,12],[36,18,36,19],[37,5,37,6],[37,18,37,19],[36,15,36,17],[37,15,37,17]]}
[]
[null,"【ルーター】NAT(アドレス変換）設定 "]
[]
[null,"※予めデフォルト設定している項目があります。それら設定がお客様ご運用において正しいかを必ずご確認のうえ、本設定シートを作成してください。なお、本シートに記載できない内容はサービス提供範囲外となります。"]
[]
[]
[null,"下記のアドレス変換図からどのアドレス変換を利用するか選択(複数可能)し、各項目に記入してください。"]
[]
[null,"(1)IPマスカレード"]
[null,null,"◆内側から外側にパケットを転送する際に送信元アドレス：ポート(例 192.168.0.100：10000から172.16.1.254：60001に）を\n　変換します。"]
[]
[]
[]
[]
[null,null,null,null,null,null,null,null,null,null,"LAN1 ",null,null,null,"LAN2"]
[null,null,null,"( .100)",null,null,null,null,null,null,"(192.168.0.254/24)",null,null,null,"(172.16.1.254/24)",null,null,null,null,null,null,null,null,null,null,"(10.10.0.200/24)"]
[]
[null,null,"送信元アドレス",null,null,"送信元ポート",null,"宛先アドレス",null,null,null,null,"変換",null,null,"送信元アドレス",null,null,"送信元ポート",null,"宛先アドレス"]
[null,null,"192.168.0.100",null,null,10000,null,"10.10.0.200",null,null,null,null,null,null,null,"172.16.1.254",null,null,60001,null,"10.10.0.200"]
[]
[null,null,"IPマスカレード",null,null,null,null,"□","：使用する",null,null,{"$f":"IF($H$21=\"☑\",\"□\",\"☑\")","v":"☑"},"：使用しない"]
[null,null,"適用インタフェース",null,null,null,null,null,null,null,"相手先番号　[　",null,null,null,"]",null,"(例)上記の場合、LAN2を選択します。"]
[null,null,"外側(変換後)の\n送信元IPアドレス",null,null,null,null,"☑","：インタフェースに設定したアドレスやプロバイダ接続で自動取得したアドレスを使用する。"]
[null,null,null,null,null,null,null,{"$f":"IF($H$23=\"☑\",\"□\",\"☑\")","v":"□"},"：アドレスを指定する　[",null,null,null,null,null,null,null,null,null,null,null,null,null,null,null,null,null,"］"]
[null,null,"内側(変換前)の対象となる\n送信元IPアドレス",null,null,null,null,"☑","：すべての送信元IPアドレス"]
[null,null,null,null,null,null,null,{"$f":"IF($H$25=\"☑\",\"□\",\"☑\")","v":"□"},"：アドレス範囲を指定する　[",null,null,null,null,null,null,null,null,null,null,null,null,null,null,null,null,null,"］"]
[]
[null,"(2)静的IPマスカレード"]
[null,null,"◆内側から外側にパケットを転送する際に送信元アドレス：ポート(例 192.168.0.100：500から172.16.1.254：500に）を変換\n　します。外側のポートと内側のポートを１対１に紐づけますので、複数のIPアドレスで同じポート番号を設定することはできません。\n　また、外側から内側へのパケット転送も可能となります。"]
[]
[]
[]
[]
[null,null,null,null,null,null,null,null,null,null,"LAN1 ",null,null,null,"LAN2"]
[null,null,null,"( .100)",null,null,null,null,null,null,"(192.168.0.254/24)",null,null,null,"(172.16.1.254/24)",null,null,null,null,null,null,null,null,null,null,"(10.10.0.200/24)"]
[]
[null,null,"送信元アドレス",null,null,"送信元ポート",null,"宛先アドレス",null,null,null,null,"変換",null,null,"送信元アドレス",null,null,"送信元ポート",null,"宛先アドレス"]
[null,null,"192.168.0.100",null,null,"UDP:500",null,"10.10.0.200",null,null,null,null,null,null,null,"172.16.1.254",null,null,"UDP:500",null,"10.10.0.200"]
[]
[null,null,"宛先アドレス",null,null,"宛先ポート",null,"送信元アドレス",null,null,null,null,"変換",null,null,"宛先アドレス",null,null,"宛先ポート",null,"送信元アドレス",null,null," 外側から内側への通信も\n 可能(ポートフォワード)"]
[null,null,"192.168.0.100",null,null,"UDP:500",null,"10.10.0.200",null,null,null,null,null,null,null,"172.16.1.254",null,null,"UDP:500",null,"10.10.0.200"]
[]
[null,null,"静的IPマスカレード",null,null,null,null,"□","：使用する",null,null,{"$f":"IF($H$43=\"☑\",\"□\",\"☑\")","v":"☑"},"：使用しない"]
[null,null,"適用インタフェース",null,null,null,null,null,null,null,"相手先番号　[",null,null,null,"]",null,"(例)上記の場合、LAN2を選択します。"]
[null,null,"外側のIPアドレス",null,null,null,null,"☑","：インタフェースに設定したアドレスやプロバイダ接続で自動取得したアドレスを使用する。"]
[null,null,null,null,null,null,null,{"$f":"IF($H$45=\"☑\",\"□\",\"☑\")","v":"□"},"：アドレスを指定する　[",null,null,null,null,null,null,null,null,null,null,null,null,null,null,null,null,null,"］"]
[null,null,"外側のIPアドレスと紐\nづける内側IPアドレス、プロトコル、ポート番号(重複しないこと）\n※行数が足りない場合、行挿入してご利用ください。",null,null,null,null,"内側のIPアドレス",null,null,null,null,null,"プロトコル",null,null,null,"ポート番号"]
[]
[]
[]
[]
[]
[]
[null,"(3)静的NAT"]
[null,null,"◆内側から外側にパケットを転送する際に送信元アドレス(例 192.168.0.100から172.16.1.100に、192.168.0.101から172.16.1.101に）を変換する。外側のIPアドレスと内側のIPアドレスを１対１に紐づける。"]
[]
[]
[]
[]
[null,null,null,null,null,null,null,null,null,null,"LAN1 ",null,null,null,"LAN2"]
[null,null,null,"( .100)",null,"( .101)",null,null,null,null,"(192.168.0.254/24)",null,null,null,"(172.16.1.254/24)",null,null,null,null,null,null,null,null,null,null,"(10.10.0.200/24)"]
[]
[null,null,null,null,"送信元アドレス",null,null,"宛先アドレス",null,null,null,null,"変換",null,null,"送信元アドレス",null,null,"宛先アドレス"]
[null,null,null,null,"192.168.0.100",null,null,"10.10.0.200",null,null,null,null,null,null,null,"172.16.1.100",null,null,"10.10.0.200"]
[]
[null,null,null,null,"宛先アドレス",null,null,"送信元アドレス",null,null,null,null,"変換",null,null,"宛先アドレス",null,null,"送信元アドレス",null,null," 外側から内側への通信も可能"]
[null,null,null,null,"192.168.0.100",null,null,"10.10.0.200",null,null,null,null,null,null,null,"172.16.1.100",null,null,"10.10.0.200"]
[]
[null,null,null,null,"送信元アドレス",null,null,"宛先アドレス",null,null,null,null,"変換",null,null,"送信元アドレス",null,null,"宛先アドレス"]
[null,null,null,null,"192.168.0.101",null,null,"10.10.0.200",null,null,null,null,null,null,null,"172.16.1.101",null,null,"10.10.0.200"]
[]
[null,null,null,null,"宛先アドレス",null,null,"送信元アドレス",null,null,null,null,"変換",null,null,"宛先アドレス",null,null,"送信元アドレス",null,null," 外側から内側への通信も可能"]
[null,null,null,null,"192.168.0.101",null,null,"10.10.0.200",null,null,null,null,null,null,null,"172.16.1.101",null,null,"10.10.0.200"]
[]
[]
[null,null,"静的NAT",null,null,null,null,"□","：使用する",null,null,{"$f":"IF($H$76=\"☑\",\"□\",\"☑\")","v":"☑"},"：使用しない"]
[null,null,"適用インタフェース",null,null,null,null,null,null,null,"相手先番号　[",null,null,null,"]",null,"(例)上記の場合、LAN2を選択します。"]
[null,null,"外側のIPアドレスと\n紐づける内側IPアドレス\n※行数が足りない場合、行挿入してご利用ください。",null,null,null,null,"外側のIPアドレス",null,null,null,null,null,"内側のIPアドレス",null,null,null,null,null,"繰り返し回数"]
[null,null,null,null,null,null,null,"例)","172.16.1.100",null,null,null,null,"192.168.0.100",null,null,null,null,null,3,null,null,"<ネットマスク>\n　外側内側とも合わせてください。\n<繰り返し回数について>\n ・デフォルトは、１（空欄時）。\n ・繰り返し回数=\"3\"の場合、\n　192.168.0.100⇒172.16.1.100\n　192.168.0.101⇒172.16.1.101\n　192.168.0.102⇒172.16.1.102\n 　の変換テーブルが作成される\n"]

{"sheet":"⑪【スイッチ➊】01.システム設定","index":18,"n_rows":28,"n_cols":8,"rows_kept":28,"cut":false,"hidden":false,"merged":[[11,3,11,7],[6,1,6,2],[6,5,6,7],[7,3,7,4],[7,5,7,7],[1,1,1,7],[3,1,4,7],[8,3,8,4],[8,5,8,7],[10,1,10,2],[10,3,10,7],[20,3,20,4],[19,5,19,6],[18,5,18,6],[13,1,13,2],[13,3,13,4],[13,5,13,7],[14,3,14,4],[14,5,14,7],[15,3,15,4],[16,3,16,4],[17,3,17,4],[20,5,20,7],[27,5,27,7],[27,3,27,4],[24,1,24,2],[24,3,24,4],[24,5,24,7],[25,3,25,4],[26,3,26,4],[26,5,26,7],[21,1,21,2],[21,3,21,4],[21,5,21,7],[22,1,22,2],[22,3,22,4],[22,5,22,7]]}
[]
[null,"【スイッチ➊】01.システム設定 "]
[]
[null,"※予めデフォルト設定している項目があります。それら設定がお客様ご運用において正しいかを必ずご確認のうえ、本設定シートを作成してください。なお、本シートに記載できない内容はサービス提供範囲外となります。"]
[]
[]
[null,"機器情報",null,"設定値",null,"説明"]
[null,"機種"]
[null,"シリアル番号",null,null,null,"サービス側で記載します。"]
[]
[null,"設置場所",null,"記入欄"]
[null,"設置場所情報"]
[]
[null,"基本情報",null,"設定値",null,"説明"]
[null,"IPv4アドレス",null,null,null,"デフォルトVLAN#1のIPv4アドレス。\n（デフォルトは、192.168.100.240/24)\n管理用PCから本機にアクセスする際のIPv4アドレス"]
[null,"日付・時刻設定",null,null,null,"\"JST\"で変更不可。"]
[null,null,"時刻同期","有効",null,"デフォルト：有効"]
[null,null,"同期間隔",1,null,"デフォルト：１　[時間]　（範囲：１－２４）"]
[null,null,"NTPサーバ","☑","：L2MSマスタのIPアドレス",{"$f":"②【ルーター】システム設定!G12","v":"192.168.100.1"},null,"本機のみ設定時は、チェックを外してアドレスを設定してください"]
[null,null,null,{"$f":"IF(OR(①【ルーター】機能選択シート!$D$18=\"□\",$D$19=\"□\"),\"☑\",\"□\")","v":"☑"},"：アドレスを設定する",null,null,"デフォルト：ntp.nict.jp"]
[null,"管理パスワード",null,null,null,"空欄や“admin”が設定されている場合は“ password ”を設定致します。"]
[null,"デフォルトゲートウェイ",null,null,null,"NTPサーバを指定する場合、本設定が必要になるケースが多いです。"]
[null,"DNSサーバアドレス",null,null,null,"NTPサーバをFQDNで指定する場合、本設定が必要です。"]
[]
[null,"機能の選択",null,"利用有無",null,"説明"]
[null,"L2スイッティング機能"]
[null,null,"タグVLAN設定","利用しない",null,"利用する場合、「⑫【スイッチ】02.タグVLAN設定」シートに詳細情報をご記入ください。"]
[null,null,"静的MACアドレス\nテーブル","静的登録しない",null,"静的登録する場合、「⑬【スイッチ】03.静的MACアドレステーブル」シートに詳細情報をご記入ください。"]

{"sheet":"⑫【スイッチ➊】02.タグVLAN設定","index":19,"n_rows":69,"n_cols":8,"rows_kept":69,"cut":false,"hidden":false,"merged":[[3,5,4,5],[1,1,1,7],[7,1,10,7],[38,5,38,6],[39,5,39,6],[33,1,34,7],[36,5,36,6],[18,1,18,2],[19,1,19,2],[13,1,13,7],[15,1,15,2],[16,1,16,2],[17,1,17,2],[20,1,20,2],[21,1,21,2],[22,1,22,2],[23,1,23,2],[60,5,60,6],[61,5,61,6],[64,5,64,6],[62,5,62,6],[24,1,24,2],[25,1,25,2],[26,1,26,2],[27,1,27,2],[28,1,28,2],[65,5,65,6],[29,1,29,2],[30,1,30,2],[32,1,32,2],[50,5,50,6],[51,5,51,6],[42,5,42,6],[41,5,41,6],[44,5,44,6],[45,5,45,6],[46,5,46,6],[47,5,47,6],[48,5,48,6],[49,5,49,6],[68,4,69,7],[40,5,40,6],[43,5,43,6],[37,5,37,6],[31,1,31,2],[52,5,52,6],[63,5,63,6],[53,5,53,6],[54,5,54,6],[55,5,55,6],[66,5,66,6],[67,5,67,6],[56,5,56,6],[57,5,57,6],[58,5,58,6],[59,5,59,6]]}
[]
[null,"【スイッチ➊】02.タグVLAN設定 "]
[]
[null,null,null,null,null,{"$f":"⑪【スイッチ➊】01.システム設定!D8&\"\"","v":""}]
[]
[]
[]
[null,"※予めデフォルト設定している項目があります。それら設定がお客様ご運用において正しいかを必ずご確認のうえ、本設定シートを作成してください。なお、本シートに記載できない内容はサービス提供範囲外となります。\n※タグVLANかつスイッチオプション構成において、スイッチオプション配下の <デフォルトVLAN以外を設定したアクセスポート> ではセキュリティ対策ツールは使用できません。(IPv6の仕様上、/64より細かいサブネットの分割できないため)。セキュリティ対策ツールを使用する場合はルータのLANポートもしくは <デフォルトVLANを設定したアクセスポート> に接続ください。"]
[]
[]
[]
[null,"タグＶＬＡＮ",null,null,{"$f":"⑪【スイッチ➊】01.システム設定!D27","v":"利用しない"}]
[]
[null,"ここで作成したVLANで本ルータにアクセスするには、「【ルーター】タグVLAN設定」シートで同じVLAN-IDのタグVLAN設定が必要です。"]
[null,"VLAN名",null,"VLAN-ID(2-4096)","フレーム転送","IPアドレス設定方法","設定するIPアドレス","備考"]
[null,"default",null,1,"有効","設定する",{"$f":"⑪【スイッチ➊】01.システム設定!D15&\"\"","v":""},"VLAN名,VLAN-ID変更不可"]
[null,"例)VLAN0010",null,10,"有効","設定しない"]
[null,null,null,null,"有効","設定しない"]
[null,null,null,null,"有効","設定しない"]
[null,null,null,null,"有効","設定しない"]
[null,null,null,null,"有効","設定しない"]
[null,null,null,null,"有効","設定しない"]
[null,null,null,null,"有効","設定しない"]
[null,null,null,null,"有効","設定しない"]
[null,null,null,null,"有効","設定しない"]
[null,null,null,null,"有効","設定しない"]
[null,null,null,null,"有効","設定しない"]
[null,null,null,null,"有効","設定しない"]
[null,null,null,null,"有効","設定しない"]
[null,null,null,null,"有効","設定しない"]
[null,null,null,null,"有効","設定しない"]
[null,null,null,null,"有効","設定しない"]
[null,null,null,null,"有効","設定しない"]
[null,"※作成可能なVLAN数はデフォルトVLAN(VLAN-ID=1)を含めて最大256個です。\n※VLAN数が16個を超える場合は、設定行を追加してご利用ください。 \n※デフォルトVLAN(VLAN-ID=1) は、フレーム転送を無効にできません。 \n※VLANを作成するとIGMPスヌーピング機能も有効になります。"]
[]
[]
[null,"インタフェース",null,"動作モード\n・アクセス\n　（デフォルト）\n・トランク","所属ネイティブVLAN-ID\n（デフォルト：1）\nトランクモード時記入","所属VLAN\n・アクセスモード：１つのアクセスVLAN-IDを記入\n・トランクモード：１つ以上のアクセスVLAN-IDを記入",null,"イングレスフィルター\n（トランクモード時）"]
[null,"例) port1",null,"トランク",1,10,null,"有効"]
[null,"例) port2",null,"アクセス",null,1,null,"有効"]
[null,"例) port3",null,"アクセス",null,10,null,"有効"]
[null,{"$f":"IF(OR(F4=\"SWX2310-28GT\",F4=\"SWX2320-16MT\"),\"port1\",\"\")","v":""},null,null,null,null,null,"有効"]
[null,{"$f":"IF(OR(F4=\"SWX2310-28GT\",F4=\"SWX2320-16MT\"),\"port2\",\"\")","v":""},null,null,null,null,null,"有効"]
[null,{"$f":"IF(OR(F4=\"SWX2310-28GT\",F4=\"SWX2320-16MT\"),\"port3\",\"\")","v":""},null,null,null,null,null,"有効"]
[null,{"$f":"IF(OR(F4=\"SWX2310-28GT\",F4=\"SWX2320-16MT\"),\"port4\",\"\")","v":""},null,null,null,null,null,"有効"]
[null,{"$f":"IF(OR(F4=\"SWX2310-28GT\",F4=\"SWX2320-16MT\"),\"port5\",\"\")","v":""},null,null,null,null,null,"有効"]
[null,{"$f":"IF(OR(F4=\"SWX2310-28GT\",F4=\"SWX2320-16MT\"),\"port6\",\"\")","v":""},null,null,null,null,null,"有効"]
[null,{"$f":"IF(OR(F4=\"SWX2310-28GT\",F4=\"SWX2320-16MT\"),\"port7\",\"\")","v":""},null,null,null,null,null,"有効"]
[null,{"$f":"IF(OR(F4=\"SWX2310-28GT\",F4=\"SWX2320-16MT\"),\"port8\",\"\")","v":""},null,null,null,null,null,"有効"]
[null,{"$f":"IF(OR(F4=\"SWX2310-28GT\",F4=\"SWX2320-16MT\"),\"port9\",\"\")","v":""},null,null,null,null,null,"有効"]
[null,{"$f":"IF(OR(F4=\"SWX2310-28GT\",F4=\"SWX2320-16MT\"),\"port10\",\"\")","v":""},null,null,null,null,null,"有効"]
[null,{"$f":"IF(OR(F4=\"SWX2310-28GT\",F4=\"SWX2320-16MT\"),\"port11\",\"\")","v":""},null,null,null,null,null,"有効"]
[null,{"$f":"IF(OR(F4=\"SWX2310-28GT\",F4=\"SWX2320-16MT\"),\"port12\",\"\")","v":""},null,null,null,null,null,"有効"]
[null,{"$f":"IF(F4=\"SWX2310-28GT\",\"port13\",IF(F4=\"SWX2320-16MT\",\"port13(SFP+)\",\"\"))","v":""},null,null,null,null,null,"有効"]
[null,{"$f":"IF(F4=\"SWX2310-28GT\",\"port14\",IF(F4=\"SWX2320-16MT\",\"port14(SFP+)\",\"\"))","v":""},null,null,null,null,null,"有効"]
[null,{"$f":"IF(F4=\"SWX2310-28GT\",\"port15\",IF(F4=\"SWX2320-16MT\",\"port15(SFP+)\",\"\"))","v":""},null,null,null,null,null,"有効"]
[null,{"$f":"IF(F4=\"SWX2310-28GT\",\"port16\",IF(F4=\"SWX2320-16MT\",\"port16(SFP+)\",\"\"))","v":""},null,null,null,null,null,"有効"]
[null,{"$f":"IF(F4=\"SWX2310-28GT\",\"port17\",IF(F4=\"SWX2320-16MT\",\"\",\"\"))","v":""},null,null,null,null,null,"有効"]
[null,{"$f":"IF(F4=\"SWX2310-28GT\",\"port18\",IF(F4=\"SWX2320-16MT\",\"\",\"\"))","v":""},null,null,null,null,null,"有効"]
[null,{"$f":"IF(F4=\"SWX2310-28GT\",\"port19\",IF(F4=\"SWX2320-16MT\",\"\",\"\"))","v":""},null,null,null,null,null,"有効"]
[null,{"$f":"IF(F4=\"SWX2310-28GT\",\"port20\",IF(F4=\"SWX2320-16MT\",\"\",\"\"))","v":""},null,null,null,null,null,"有効"]
[null,{"$f":"IF(F4=\"SWX2310-28GT\",\"port21\",IF(F4=\"SWX2320-16MT\",\"\",\"\"))","v":""},null,null,null,null,null,"有効"]
[null,{"$f":"IF(F4=\"SWX2310-28GT\",\"port22\",IF(F4=\"SWX2320-16MT\",\"\",\"\"))","v":""},null,null,null,null,null,"有効"]
[null,{"$f":"IF(F4=\"SWX2310-28GT\",\"port23\",IF(F4=\"SWX2320-16MT\",\"\",\"\"))","v":""},null,null,null,null,null,"有効"]
[null,{"$f":"IF(F4=\"SWX2310-28GT\",\"port24\",IF(F4=\"SWX2320-16MT\",\"\",\"\"))","v":""},null,null,null,null,null,"有効"]
[null,{"$f":"IF(F4=\"SWX2310-28GT\",\"port25(SFP)\",IF(F4=\"SWX2320-16MT\",\"\",\"\"))","v":""},null,null,null,null,null,"有効"]
[null,{"$f":"IF(F4=\"SWX2310-28GT\",\"port26(SFP)\",IF(F4=\"SWX2320-16MT\",\"\",\"\"))","v":""},null,null,null,null,null,"有効"]
[null,{"$f":"IF(F4=\"SWX2310-28GT\",\"port27(SFP)\",IF(F4=\"SWX2320-16MT\",\"\",\"\"))","v":""},null,null,null,null,null,"有効"]
[null,{"$f":"IF(F4=\"SWX2310-28GT\",\"port28(SFP)\",IF(F4=\"SWX2320-16MT\",\"\",\"\"))","v":""},null,null,null,null,null,"有効"]
[null,"※イングレスフィルター",null,null,"　・ 有効 ( 受信フレームのVLAN IDと所属VLANが同じ場合のみ受信する )\n　・ 無効 ( 全てのフレームを受信する )"]

{"sheet":"⑬【スイッチ➊】03.静的MACアドレステーブル","index":20,"n_rows":10,"n_cols":7,"rows_kept":10,"cut":false,"hidden":false,"merged":[[4,1,4,7],[1,1,1,7],[8,1,8,3],[8,6,8,7],[12,1,12,3],[12,6,12,7],[9,1,9,3],[9,6,9,7],[10,1,10,3],[10,6,10,7],[11,1,11,3],[11,6,11,7],[5,1,5,3],[13,1,13,3],[13,6,13,7],[14,1,14,3],[14,6,14,7],[18,1,18,3],[18,6,18,7],[16,6,16,7],[17,1,17,3],[17,6,17,7],[15,1,15,3],[15,6,15,7],[16,1,16,3],[19,1,19,3],[19,6,19,7],[20,1,20,3],[20,6,20,7],[21,1,21,3],[21,6,21,7],[22,1,22,3],[22,6,22,7],[23,1,23,3],[23,6,23,7],[24,1,24,3],[24,6,24,7],[25,1,25,3],[25,6,25,7],[32,6,32,7],[26,1,26,3],[26,6,26,7],[27,1,27,3],[27,6,27,7],[28,1,28,3],[28,6,28,7],[42,1,42,3],[42,6,42,7],[39,1,39,3],[39,6,39,7],[40,1,40,3],[40,6,40,7],[41,1,41,3],[41,6,41,7],[36,1,36,3],[36,6,36,7],[37,1,37,3],[37,6,37,7],[38,1,38,3],[38,6,38,7],[43,1,43,3],[43,6,43,7],[44,1,44,3],[44,6,44,7],[7,1,7,7],[33,1,33,3],[33,6,33,7],[34,1,34,3],[34,6,34,7],[35,1,35,3],[35,6,35,7],[29,1,29,3],[29,6,29,7],[30,1,30,3],[30,6,30,7],[32,1,32,3]]}
[]
[null,"【スイッチ➊】03.静的MACアドレステーブル "]
[]
[]
[null,"※予めデフォルト設定している項目があります。それら設定がお客様ご運用において正しいかを必ずご確認のうえ、本設定シートを作成してください。なお、本シートに記載できない内容はサービス提供範囲外となります。"]
[null,"静的MACアドレステーブル",null,null,{"$f":"⑪【スイッチ➊】01.システム設定!D28","v":"静的登録しない"}]
[]
[null,"■静的にMACアドレステーブルを登録します。\n　設定可能数は、最大512です。行挿入にてご利用ください。"]
[null,"宛先MACアドレス\n（hhhh.hhhh.hhhh形式）",null,null,"宛先MACアドレス\n宛てのフレーム転送\n・転送する(デフォルト)\n・破棄する","転送先VLAN-ID","転送先インタフェース"]
[null,"例)BCC3:42C4:0EEA",null,null,"転送する",10,"ge3"]

{"sheet":"⑪【スイッチ➋】01.システム設定","index":21,"n_rows":28,"n_cols":8,"rows_kept":28,"cut":false,"hidden":false,"merged":[[25,3,25,4],[26,3,26,4],[26,5,26,7],[27,3,27,4],[27,5,27,7],[22,1,22,2],[22,3,22,4],[22,5,22,7],[24,1,24,2],[24,3,24,4],[24,5,24,7],[19,5,19,6],[20,3,20,4],[20,5,20,7],[21,1,21,2],[21,3,21,4],[21,5,21,7],[18,5,18,6],[8,3,8,4],[8,5,8,7],[10,1,10,2],[10,3,10,7],[11,3,11,7],[13,1,13,2],[13,3,13,4],[13,5,13,7],[14,3,14,4],[14,5,14,7],[15,3,15,4],[16,3,16,4],[17,3,17,4],[1,1,1,7],[3,1,4,7],[6,1,6,2],[6,5,6,7],[7,3,7,4],[7,5,7,7]]}
[]
[null,"【スイッチ➋】01.システム設定 "]
[]
[null,"※予めデフォルト設定している項目があります。それら設定がお客様ご運用において正しいかを必ずご確認のうえ、本設定シートを作成してください。なお、本シートに記載できない内容はサービス提供範囲外となります。"]
[]
[]
[null,"機器情報",null,"設定値",null,"説明"]
[null,"機種"]
[null,"シリアル番号",null,null,null,"サービス側で記載します。"]
[]
[null,"設置場所",null,"記入欄"]
[null,"設置場所情報"]
[]
[null,"基本情報",null,"設定値",null,"説明"]
[null,"IPv4アドレス",null,null,null,"デフォルトVLAN#1のIPv4アドレス。\n（デフォルトは、192.168.100.240/24)\n管理用PCから本機にアクセスする際のIPv4アドレス"]
[null,"日付・時刻設定",null,null,null,"\"JST\"で変更不可。"]
[null,null,"時刻同期","有効",null,"デフォルト：有効"]
[null,null,"同期間隔",1,null,"デフォルト：１　[時間]　（範囲：１－２４）"]
[null,null,"NTPサーバ","☑","：L2MSマスタのIPアドレス",{"$f":"②【ルーター】システム設定!G12","v":"192.168.100.1"},null,"本機のみ設定時は、チェックを外してアドレスを設定してください"]
[null,null,null,{"$f":"IF(OR(①【ルーター】機能選択シート!$D$18=\"□\",$D$19=\"□\"),\"☑\",\"□\")","v":"☑"},"：アドレスを設定する",null,null,"デフォルト：ntp.nict.jp"]
[null,"管理パスワード",null,null,null,"空欄や“admin”が設定されている場合は“ password ”を設定致します。"]
[null,"デフォルトゲートウェイ",null,null,null,"NTPサーバを指定する場合、本設定が必要になるケースが多いです。"]
[null,"DNSサーバアドレス",null,null,null,"NTPサーバをFQDNで指定する場合、本設定が必要です。"]
[]
[null,"機能の選択",null,"利用有無",null,"説明"]
[null,"L2スイッティング機能"]
[null,null,"タグVLAN設定","利用しない",null,"利用する場合、「⑫【スイッチ】02.タグVLAN設定」シートに詳細情報をご記入ください。"]
[null,null,"静的MACアドレス\nテーブル","静的登録しない",null,"静的登録する場合、「⑬【スイッチ】03.静的MACアドレステーブル」シートに詳細情報をご記入ください。"]

{"sheet":"⑫【スイッチ➋】02.タグVLAN設定","index":22,"n_rows":69,"n_cols":8,"rows_kept":69,"cut":false,"hidden":false,"merged":[[67,5,67,6],[68,4,69,7],[61,5,61,6],[62,5,62,6],[63,5,63,6],[64,5,64,6],[65,5,65,6],[66,5,66,6],[60,5,60,6],[49,5,49,6],[50,5,50,6],[51,5,51,6],[52,5,52,6],[53,5,53,6],[54,5,54,6],[55,5,55,6],[56,5,56,6],[57,5,57,6],[58,5,58,6],[59,5,59,6],[48,5,48,6],[37,5,37,6],[38,5,38,6],[39,5,39,6],[40,5,40,6],[41,5,41,6],[42,5,42,6],[43,5,43,6],[44,5,44,6],[45,5,45,6],[46,5,46,6],[47,5,47,6],[36,5,36,6],[23,1,23,2],[24,1,24,2],[25,1,25,2],[26,1,26,2],[27,1,27,2],[28,1,28,2],[29,1,29,2],[30,1,30,2],[31,1,31,2],[32,1,32,2],[33,1,34,7],[22,1,22,2],[1,1,1,7],[3,5,4,5],[7,1,10,7],[13,1,13,7],[15,1,15,2],[16,1,16,2],[17,1,17,2],[18,1,18,2],[19,1,19,2],[20,1,20,2],[21,1,21,2]]}
[]
[null,"【スイッチ➋】02.タグVLAN設定 "]
[]
[null,null,null,null,null,{"$f":"⑪【スイッチ➋】01.システム設定!D8&\"\"","v":""}]
[]
[]
[]
[null,"※予めデフォルト設定している項目があります。それら設定がお客様ご運用において正しいかを必ずご確認のうえ、本設定シートを作成してください。なお、本シートに記載できない内容はサービス提供範囲外となります。\n※タグVLANかつスイッチオプション構成において、スイッチオプション配下の <デフォルトVLAN以外を設定したアクセスポート> ではセキュリティ対策ツールは使用できません。(IPv6の仕様上、/64より細かいサブネットの分割できないため)。セキュリティ対策ツールを使用する場合はルータのLANポートもしくは <デフォルトVLANを設定したアクセスポート> に接続ください。"]
[]
[]
[]
[null,"タグＶＬＡＮ",null,null,{"$f":"⑪【スイッチ➋】01.システム設定!D27","v":"利用しない"}]
[]
[null,"ここで作成したVLANで本ルータにアクセスするには、「【ルーター】タグVLAN設定」シートで同じVLAN-IDのタグVLAN設定が必要です。"]
[null,"VLAN名",null,"VLAN-ID(2-4096)","フレーム転送","IPアドレス設定方法","設定するIPアドレス","備考"]
[null,"default",null,1,"有効","設定する",{"$f":"⑪【スイッチ➊】01.システム設定!D15&\"\"","v":""},"VLAN名,VLAN-ID変更不可"]
[null,"例)VLAN0010",null,10,"有効","設定しない"]
[null,null,null,null,"有効","設定しない"]
[null,null,null,null,"有効","設定しない"]
[null,null,null,null,"有効","設定しない"]
[null,null,null,null,"有効","設定しない"]
[null,null,null,null,"有効","設定しない"]
[null,null,null,null,"有効","設定しない"]
[null,null,null,null,"有効","設定しない"]
[null,null,null,null,"有効","設定しない"]
[null,null,null,null,"有効","設定しない"]
[null,null,null,null,"有効","設定しない"]
[null,null,null,null,"有効","設定しない"]
[null,null,null,null,"有効","設定しない"]
[null,null,null,null,"有効","設定しない"]
[null,null,null,null,"有効","設定しない"]
[null,null,null,null,"有効","設定しない"]
[null,null,null,null,"有効","設定しない"]
[null,"※作成可能なVLAN数はデフォルトVLAN(VLAN-ID=1)を含めて最大256個です。\n※VLAN数が16個を超える場合は、設定行を追加してご利用ください。 \n※デフォルトVLAN(VLAN-ID=1) は、フレーム転送を無効にできません。 \n※VLANを作成するとIGMPスヌーピング機能も有効になります。"]
[]
[]
[null,"インタフェース",null,"動作モード\n・アクセス\n　（デフォルト）\n・トランク","所属ネイティブVLAN-ID\n（デフォルト：1）\nトランクモード時記入","所属VLAN\n・アクセスモード：１つのアクセスVLAN-IDを記入\n・トランクモード：１つ以上のアクセスVLAN-IDを記入",null,"イングレスフィルター\n（トランクモード時）"]
[null,"例) port1",null,"トランク",1,10,null,"有効"]
[null,"例) port2",null,"アクセス",null,1,null,"有効"]
[null,"例) port3",null,"アクセス",null,10,null,"有効"]
[null,{"$f":"IF(OR(F4=\"SWX2310-28GT\",F4=\"SWX2320-16MT\"),\"port1\",\"\")","v":""},null,null,null,null,null,"有効"]
[null,{"$f":"IF(OR(F4=\"SWX2310-28GT\",F4=\"SWX2320-16MT\"),\"port2\",\"\")","v":""},null,null,null,null,null,"有効"]
[null,{"$f":"IF(OR(F4=\"SWX2310-28GT\",F4=\"SWX2320-16MT\"),\"port3\",\"\")","v":""},null,null,null,null,null,"有効"]
[null,{"$f":"IF(OR(F4=\"SWX2310-28GT\",F4=\"SWX2320-16MT\"),\"port4\",\"\")","v":""},null,null,null,null,null,"有効"]
[null,{"$f":"IF(OR(F4=\"SWX2310-28GT\",F4=\"SWX2320-16MT\"),\"port5\",\"\")","v":""},null,null,null,null,null,"有効"]
[null,{"$f":"IF(OR(F4=\"SWX2310-28GT\",F4=\"SWX2320-16MT\"),\"port6\",\"\")","v":""},null,null,null,null,null,"有効"]
[null,{"$f":"IF(OR(F4=\"SWX2310-28GT\",F4=\"SWX2320-16MT\"),\"port7\",\"\")","v":""},null,null,null,null,null,"有効"]
[null,{"$f":"IF(OR(F4=\"SWX2310-28GT\",F4=\"SWX2320-16MT\"),\"port8\",\"\")","v":""},null,null,null,null,null,"有効"]
[null,{"$f":"IF(OR(F4=\"SWX2310-28GT\",F4=\"SWX2320-16MT\"),\"port9\",\"\")","v":""},null,null,null,null,null,"有効"]
[null,{"$f":"IF(OR(F4=\"SWX2310-28GT\",F4=\"SWX2320-16MT\"),\"port10\",\"\")","v":""},null,null,null,null,null,"有効"]
[null,{"$f":"IF(OR(F4=\"SWX2310-28GT\",F4=\"SWX2320-16MT\"),\"port11\",\"\")","v":""},null,null,null,null,null,"有効"]
[null,{"$f":"IF(OR(F4=\"SWX2310-28GT\",F4=\"SWX2320-16MT\"),\"port12\",\"\")","v":""},null,null,null,null,null,"有効"]
[null,{"$f":"IF(F4=\"SWX2310-28GT\",\"port13\",IF(F4=\"SWX2320-16MT\",\"port13(SFP+)\",\"\"))","v":""},null,null,null,null,null,"有効"]
[null,{"$f":"IF(F4=\"SWX2310-28GT\",\"port14\",IF(F4=\"SWX2320-16MT\",\"port14(SFP+)\",\"\"))","v":""},null,null,null,null,null,"有効"]
[null,{"$f":"IF(F4=\"SWX2310-28GT\",\"port15\",IF(F4=\"SWX2320-16MT\",\"port15(SFP+)\",\"\"))","v":""},null,null,null,null,null,"有効"]
[null,{"$f":"IF(F4=\"SWX2310-28GT\",\"port16\",IF(F4=\"SWX2320-16MT\",\"port16(SFP+)\",\"\"))","v":""},null,null,null,null,null,"有効"]
[null,{"$f":"IF(F4=\"SWX2310-28GT\",\"port17\",IF(F4=\"SWX2320-16MT\",\"\",\"\"))","v":""},null,null,null,null,null,"有効"]
[null,{"$f":"IF(F4=\"SWX2310-28GT\",\"port18\",IF(F4=\"SWX2320-16MT\",\"\",\"\"))","v":""},null,null,null,null,null,"有効"]
[null,{"$f":"IF(F4=\"SWX2310-28GT\",\"port19\",IF(F4=\"SWX2320-16MT\",\"\",\"\"))","v":""},null,null,null,null,null,"有効"]
[null,{"$f":"IF(F4=\"SWX2310-28GT\",\"port20\",IF(F4=\"SWX2320-16MT\",\"\",\"\"))","v":""},null,null,null,null,null,"有効"]
[null,{"$f":"IF(F4=\"SWX2310-28GT\",\"port21\",IF(F4=\"SWX2320-16MT\",\"\",\"\"))","v":""},null,null,null,null,null,"有効"]
[null,{"$f":"IF(F4=\"SWX2310-28GT\",\"port22\",IF(F4=\"SWX2320-16MT\",\"\",\"\"))","v":""},null,null,null,null,null,"有効"]
[null,{"$f":"IF(F4=\"SWX2310-28GT\",\"port23\",IF(F4=\"SWX2320-16MT\",\"\",\"\"))","v":""},null,null,null,null,null,"有効"]
[null,{"$f":"IF(F4=\"SWX2310-28GT\",\"port24\",IF(F4=\"SWX2320-16MT\",\"\",\"\"))","v":""},null,null,null,null,null,"有効"]
[null,{"$f":"IF(F4=\"SWX2310-28GT\",\"port25(SFP)\",IF(F4=\"SWX2320-16MT\",\"\",\"\"))","v":""},null,null,null,null,null,"有効"]
[null,{"$f":"IF(F4=\"SWX2310-28GT\",\"port26(SFP)\",IF(F4=\"SWX2320-16MT\",\"\",\"\"))","v":""},null,null,null,null,null,"有効"]
[null,{"$f":"IF(F4=\"SWX2310-28GT\",\"port27(SFP)\",IF(F4=\"SWX2320-16MT\",\"\",\"\"))","v":""},null,null,null,null,null,"有効"]
[null,{"$f":"IF(F4=\"SWX2310-28GT\",\"port28(SFP)\",IF(F4=\"SWX2320-16MT\",\"\",\"\"))","v":""},null,null,null,null,null,"有効"]
[null,"※イングレスフィルター",null,null,"　・ 有効 ( 受信フレームのVLAN IDと所属VLANが同じ場合のみ受信する )\n　・ 無効 ( 全てのフレームを受信する )"]

{"sheet":"⑬【スイッチ➋】03.静的MACアドレステーブル","index":23,"n_rows":10,"n_cols":7,"rows_kept":10,"cut":false,"hidden":false,"merged":[[43,1,43,3],[43,6,43,7],[44,1,44,3],[44,6,44,7],[40,1,40,3],[40,6,40,7],[41,1,41,3],[41,6,41,7],[42,1,42,3],[42,6,42,7],[37,1,37,3],[37,6,37,7],[38,1,38,3],[38,6,38,7],[39,1,39,3],[39,6,39,7],[34,1,34,3],[34,6,34,7],[35,1,35,3],[35,6,35,7],[36,1,36,3],[36,6,36,7],[30,1,30,3],[30,6,30,7],[32,1,32,3],[32,6,32,7],[33,1,33,3],[33,6,33,7],[27,1,27,3],[27,6,27,7],[28,1,28,3],[28,6,28,7],[29,1,29,3],[29,6,29,7],[24,1,24,3],[24,6,24,7],[25,1,25,3],[25,6,25,7],[26,1,26,3],[26,6,26,7],[21,1,21,3],[21,6,21,7],[22,1,22,3],[22,6,22,7],[23,1,23,3],[23,6,23,7],[18,1,18,3],[18,6,18,7],[19,1,19,3],[19,6,19,7],[20,1,20,3],[20,6,20,7],[15,1,15,3],[15,6,15,7],[16,1,16,3],[16,6,16,7],[17,1,17,3],[17,6,17,7],[12,1,12,3],[12,6,12,7],[13,1,13,3],[13,6,13,7],[14,1,14,3],[14,6,14,7],[9,1,9,3],[9,6,9,7],[10,1,10,3],[10,6,10,7],[11,1,11,3],[11,6,11,7],[1,1,1,7],[4,1,4,7],[5,1,5,3],[7,1,7,7],[8,1,8,3],[8,6,8,7]]}
[]
[null,"【スイッチ➋】03.静的MACアドレステーブル "]
[]
[]
[null,"※予めデフォルト設定している項目があります。それら設定がお客様ご運用において正しいかを必ずご確認のうえ、本設定シートを作成してください。なお、本シートに記載できない内容はサービス提供範囲外となります。"]
[null,"静的MACアドレステーブル",null,null,{"$f":"⑪【スイッチ➋】01.システム設定!D28","v":"静的登録しない"}]
[]
[null,"■静的にMACアドレステーブルを登録します。\n　設定可能数は、最大512です。行挿入にてご利用ください。"]
[null,"宛先MACアドレス\n（hhhh.hhhh.hhhh形式）",null,null,"宛先MACアドレス\n宛てのフレーム転送\n・転送する(デフォルト)\n・破棄する","転送先VLAN-ID","転送先インタフェース"]
[null,"例)BCC3:42C4:0EEA",null,null,"転送する",10,"ge3"]

{"sheet":"⑪【スイッチ❸】01.システム設定","index":24,"n_rows":28,"n_cols":8,"rows_kept":28,"cut":false,"hidden":false,"merged":[[25,3,25,4],[26,3,26,4],[26,5,26,7],[27,3,27,4],[27,5,27,7],[22,1,22,2],[22,3,22,4],[22,5,22,7],[24,1,24,2],[24,3,24,4],[24,5,24,7],[19,5,19,6],[20,3,20,4],[20,5,20,7],[21,1,21,2],[21,3,21,4],[21,5,21,7],[18,5,18,6],[8,3,8,4],[8,5,8,7],[10,1,10,2],[10,3,10,7],[11,3,11,7],[13,1,13,2],[13,3,13,4],[13,5,13,7],[14,3,14,4],[14,5,14,7],[15,3,15,4],[16,3,16,4],[17,3,17,4],[1,1,1,7],[3,1,4,7],[6,1,6,2],[6,5,6,7],[7,3,7,4],[7,5,7,7]]}
[]
[null,"【スイッチ❸】01.システム設定 "]
[]
[null,"※予めデフォルト設定している項目があります。それら設定がお客様ご運用において正しいかを必ずご確認のうえ、本設定シートを作成してください。なお、本シートに記載できない内容はサービス提供範囲外となります。"]
[]
[]
[null,"機器情報",null,"設定値",null,"説明"]
[null,"機種"]
[null,"シリアル番号",null,null,null,"サービス側で記載します。"]
[]
[null,"設置場所",null,"記入欄"]
[null,"設置場所情報"]
[]
[null,"基本情報",null,"設定値",null,"説明"]
[null,"IPv4アドレス",null,null,null,"デフォルトVLAN#1のIPv4アドレス。\n（デフォルトは、192.168.100.240/24)\n管理用PCから本機にアクセスする際のIPv4アドレス"]
[null,"日付・時刻設定",null,null,null,"\"JST\"で変更不可。"]
[null,null,"時刻同期","有効",null,"デフォルト：有効"]
[null,null,"同期間隔",1,null,"デフォルト：１　[時間]　（範囲：１－２４）"]
[null,null,"NTPサーバ","☑","：L2MSマスタのIPアドレス",{"$f":"②【ルーター】システム設定!G12","v":"192.168.100.1"},null,"本機のみ設定時は、チェックを外してアドレスを設定してください"]
[null,null,null,{"$f":"IF(OR(①【ルーター】機能選択シート!$D$18=\"□\",$D$19=\"□\"),\"☑\",\"□\")","v":"☑"},"：アドレスを設定する",null,null,"デフォルト：ntp.nict.jp"]
[null,"管理パスワード",null,null,null,"空欄や“admin”が設定されている場合は“ password ”を設定致します。"]
[null,"デフォルトゲートウェイ",null,null,null,"NTPサーバを指定する場合、本設定が必要になるケースが多いです。"]
[null,"DNSサーバアドレス",null,null,null,"NTPサーバをFQDNで指定する場合、本設定が必要です。"]
[]
[null,"機能の選択",null,"利用有無",null,"説明"]
[null,"L2スイッティング機能"]
[null,null,"タグVLAN設定","利用しない",null,"利用する場合、「⑫【スイッチ】02.タグVLAN設定」シートに詳細情報をご記入ください。"]
[null,null,"静的MACアドレス\nテーブル","静的登録しない",null,"静的登録する場合、「⑬【スイッチ】03.静的MACアドレステーブル」シートに詳細情報をご記入ください。"]

{"sheet":"⑫【スイッチ❸】02.タグVLAN設定","index":25,"n_rows":69,"n_cols":8,"rows_kept":69,"cut":false,"hidden":false,"merged":[[67,5,67,6],[68,4,69,7],[61,5,61,6],[62,5,62,6],[63,5,63,6],[64,5,64,6],[65,5,65,6],[66,5,66,6],[60,5,60,6],[49,5,49,6],[50,5,50,6],[51,5,51,6],[52,5,52,6],[53,5,53,6],[54,5,54,6],[55,5,55,6],[56,5,56,6],[57,5,57,6],[58,5,58,6],[59,5,59,6],[48,5,48,6],[37,5,37,6],[38,5,38,6],[39,5,39,6],[40,5,40,6],[41,5,41,6],[42,5,42,6],[43,5,43,6],[44,5,44,6],[45,5,45,6],[46,5,46,6],[47,5,47,6],[36,5,36,6],[23,1,23,2],[24,1,24,2],[25,1,25,2],[26,1,26,2],[27,1,27,2],[28,1,28,2],[29,1,29,2],[30,1,30,2],[31,1,31,2],[32,1,32,2],[33,1,34,7],[22,1,22,2],[1,1,1,7],[3,5,4,5],[7,1,10,7],[13,1,13,7],[15,1,15,2],[16,1,16,2],[17,1,17,2],[18,1,18,2],[19,1,19,2],[20,1,20,2],[21,1,21,2]]}
[]
[null,"【スイッチ❸】02.タグVLAN設定 "]
[]
[null,null,null,null,null,{"$f":"⑪【スイッチ❸】01.システム設定!D8&\"\"","v":""}]
[]
[]
[]
[null,"※予めデフォルト設定している項目があります。それら設定がお客様ご運用において正しいかを必ずご確認のうえ、本設定シートを作成してください。なお、本シートに記載できない内容はサービス提供範囲外となります。\n※タグVLANかつスイッチオプション構成において、スイッチオプション配下の <デフォルトVLAN以外を設定したアクセスポート> ではセキュリティ対策ツールは使用できません。(IPv6の仕様上、/64より細かいサブネットの分割できないため)。セキュリティ対策ツールを使用する場合はルータのLANポートもしくは <デフォルトVLANを設定したアクセスポート> に接続ください。"]
[]
[]
[]
[null,"タグＶＬＡＮ",null,null,{"$f":"⑪【スイッチ❸】01.システム設定!D27","v":"利用しない"}]
[]
[null,"ここで作成したVLANで本ルータにアクセスするには、「【ルーター】タグVLAN設定」シートで同じVLAN-IDのタグVLAN設定が必要です。"]
[null,"VLAN名",null,"VLAN-ID(2-4096)","フレーム転送","IPアドレス設定方法","設定するIPアドレス","備考"]
[null,"default",null,1,"有効","設定する",{"$f":"⑪【スイッチ❸】01.システム設定!D15&\"\"","v":""},"VLAN名,VLAN-ID変更不可"]
[null,"例)VLAN0010",null,10,"有効","設定しない"]
[null,null,null,null,"有効","設定しない"]
[null,null,null,null,"有効","設定しない"]
[null,null,null,null,"有効","設定しない"]
[null,null,null,null,"有効","設定しない"]
[null,null,null,null,"有効","設定しない"]
[null,null,null,null,"有効","設定しない"]
[null,null,null,null,"有効","設定しない"]
[null,null,null,null,"有効","設定しない"]
[null,null,null,null,"有効","設定しない"]
[null,null,null,null,"有効","設定しない"]
[null,null,null,null,"有効","設定しない"]
[null,null,null,null,"有効","設定しない"]
[null,null,null,null,"有効","設定しない"]
[null,null,null,null,"有効","設定しない"]
[null,null,null,null,"有効","設定しない"]
[null,null,null,null,"有効","設定しない"]
[null,"※作成可能なVLAN数はデフォルトVLAN(VLAN-ID=1)を含めて最大256個です。\n※VLAN数が16個を超える場合は、設定行を追加してご利用ください。 \n※デフォルトVLAN(VLAN-ID=1) は、フレーム転送を無効にできません。 \n※VLANを作成するとIGMPスヌーピング機能も有効になります。"]
[]
[]
[null,"インタフェース",null,"動作モード\n・アクセス\n　（デフォルト）\n・トランク","所属ネイティブVLAN-ID\n（デフォルト：1）\nトランクモード時記入","所属VLAN\n・アクセスモード：１つのアクセスVLAN-IDを記入\n・トランクモード：１つ以上のアクセスVLAN-IDを記入",null,"イングレスフィルター\n（トランクモード時）"]
[null,"例) port1",null,"トランク",1,10,null,"有効"]
[null,"例) port2",null,"アクセス",null,1,null,"有効"]
[null,"例) port3",null,"アクセス",null,10,null,"有効"]
[null,{"$f":"IF(OR(F4=\"SWX2310-28GT\",F4=\"SWX2320-16MT\"),\"port1\",\"\")","v":""},null,null,null,null,null,"有効"]
[null,{"$f":"IF(OR(F4=\"SWX2310-28GT\",F4=\"SWX2320-16MT\"),\"port2\",\"\")","v":""},null,null,null,null,null,"有効"]
[null,{"$f":"IF(OR(F4=\"SWX2310-28GT\",F4=\"SWX2320-16MT\"),\"port3\",\"\")","v":""},null,null,null,null,null,"有効"]
[null,{"$f":"IF(OR(F4=\"SWX2310-28GT\",F4=\"SWX2320-16MT\"),\"port4\",\"\")","v":""},null,null,null,null,null,"有効"]
[null,{"$f":"IF(OR(F4=\"SWX2310-28GT\",F4=\"SWX2320-16MT\"),\"port5\",\"\")","v":""},null,null,null,null,null,"有効"]
[null,{"$f":"IF(OR(F4=\"SWX2310-28GT\",F4=\"SWX2320-16MT\"),\"port6\",\"\")","v":""},null,null,null,null,null,"有効"]
[null,{"$f":"IF(OR(F4=\"SWX2310-28GT\",F4=\"SWX2320-16MT\"),\"port7\",\"\")","v":""},null,null,null,null,null,"有効"]
[null,{"$f":"IF(OR(F4=\"SWX2310-28GT\",F4=\"SWX2320-16MT\"),\"port8\",\"\")","v":""},null,null,null,null,null,"有効"]
[null,{"$f":"IF(OR(F4=\"SWX2310-28GT\",F4=\"SWX2320-16MT\"),\"port9\",\"\")","v":""},null,null,null,null,null,"有効"]
[null,{"$f":"IF(OR(F4=\"SWX2310-28GT\",F4=\"SWX2320-16MT\"),\"port10\",\"\")","v":""},null,null,null,null,null,"有効"]
[null,{"$f":"IF(OR(F4=\"SWX2310-28GT\",F4=\"SWX2320-16MT\"),\"port11\",\"\")","v":""},null,null,null,null,null,"有効"]
[null,{"$f":"IF(OR(F4=\"SWX2310-28GT\",F4=\"SWX2320-16MT\"),\"port12\",\"\")","v":""},null,null,null,null,null,"有効"]
[null,{"$f":"IF(F4=\"SWX2310-28GT\",\"port13\",IF(F4=\"SWX2320-16MT\",\"port13(SFP+)\",\"\"))","v":""},null,null,null,null,null,"有効"]
[null,{"$f":"IF(F4=\"SWX2310-28GT\",\"port14\",IF(F4=\"SWX2320-16MT\",\"port14(SFP+)\",\"\"))","v":""},null,null,null,null,null,"有効"]
[null,{"$f":"IF(F4=\"SWX2310-28GT\",\"port15\",IF(F4=\"SWX2320-16MT\",\"port15(SFP+)\",\"\"))","v":""},null,null,null,null,null,"有効"]
[null,{"$f":"IF(F4=\"SWX2310-28GT\",\"port16\",IF(F4=\"SWX2320-16MT\",\"port16(SFP+)\",\"\"))","v":""},null,null,null,null,null,"有効"]
[null,{"$f":"IF(F4=\"SWX2310-28GT\",\"port17\",IF(F4=\"SWX2320-16MT\",\"\",\"\"))","v":""},null,null,null,null,null,"有効"]
[null,{"$f":"IF(F4=\"SWX2310-28GT\",\"port18\",IF(F4=\"SWX2320-16MT\",\"\",\"\"))","v":""},null,null,null,null,null,"有効"]
[null,{"$f":"IF(F4=\"SWX2310-28GT\",\"port19\",IF(F4=\"SWX2320-16MT\",\"\",\"\"))","v":""},null,null,null,null,null,"有効"]
[null,{"$f":"IF(F4=\"SWX2310-28GT\",\"port20\",IF(F4=\"SWX2320-16MT\",\"\",\"\"))","v":""},null,null,null,null,null,"有効"]
[null,{"$f":"IF(F4=\"SWX2310-28GT\",\"port21\",IF(F4=\"SWX2320-16MT\",\"\",\"\"))","v":""},null,null,null,null,null,"有効"]
[null,{"$f":"IF(F4=\"SWX2310-28GT\",\"port22\",IF(F4=\"SWX2320-16MT\",\"\",\"\"))","v":""},null,null,null,null,null,"有効"]
[null,{"$f":"IF(F4=\"SWX2310-28GT\",\"port23\",IF(F4=\"SWX2320-16MT\",\"\",\"\"))","v":""},null,null,null,null,null,"有効"]
[null,{"$f":"IF(F4=\"SWX2310-28GT\",\"port24\",IF(F4=\"SWX2320-16MT\",\"\",\"\"))","v":""},null,null,null,null,null,"有効"]
[null,{"$f":"IF(F4=\"SWX2310-28GT\",\"port25(SFP)\",IF(F4=\"SWX2320-16MT\",\"\",\"\"))","v":""},null,null,null,null,null,"有効"]
[null,{"$f":"IF(F4=\"SWX2310-28GT\",\"port26(SFP)\",IF(F4=\"SWX2320-16MT\",\"\",\"\"))","v":""},null,null,null,null,null,"有効"]
[null,{"$f":"IF(F4=\"SWX2310-28GT\",\"port27(SFP)\",IF(F4=\"SWX2320-16MT\",\"\",\"\"))","v":""},null,null,null,null,null,"有効"]
[null,{"$f":"IF(F4=\"SWX2310-28GT\",\"port28(SFP)\",IF(F4=\"SWX2320-16MT\",\"\",\"\"))","v":""},null,null,null,null,null,"有効"]
[null,"※イングレスフィルター",null,null,"　・ 有効 ( 受信フレームのVLAN IDと所属VLANが同じ場合のみ受信する )\n　・ 無効 ( 全てのフレームを受信する )"]

{"sheet":"⑬【スイッチ❸】03.静的MACアドレステーブル","index":26,"n_rows":10,"n_cols":7,"rows_kept":10,"cut":false,"hidden":false,"merged":[[43,1,43,3],[43,6,43,7],[44,1,44,3],[44,6,44,7],[40,1,40,3],[40,6,40,7],[41,1,41,3],[41,6,41,7],[42,1,42,3],[42,6,42,7],[37,1,37,3],[37,6,37,7],[38,1,38,3],[38,6,38,7],[39,1,39,3],[39,6,39,7],[34,1,34,3],[34,6,34,7],[35,1,35,3],[35,6,35,7],[36,1,36,3],[36,6,36,7],[30,1,30,3],[30,6,30,7],[32,1,32,3],[32,6,32,7],[33,1,33,3],[33,6,33,7],[27,1,27,3],[27,6,27,7],[28,1,28,3],[28,6,28,7],[29,1,29,3],[29,6,29,7],[24,1,24,3],[24,6,24,7],[25,1,25,3],[25,6,25,7],[26,1,26,3],[26,6,26,7],[21,1,21,3],[21,6,21,7],[22,1,22,3],[22,6,22,7],[23,1,23,3],[23,6,23,7],[18,1,18,3],[18,6,18,7],[19,1,19,3],[19,6,19,7],[20,1,20,3],[20,6,20,7],[15,1,15,3],[15,6,15,7],[16,1,16,3],[16,6,16,7],[17,1,17,3],[17,6,17,7],[12,1,12,3],[12,6,12,7],[13,1,13,3],[13,6,13,7],[14,1,14,3],[14,6,14,7],[9,1,9,3],[9,6,9,7],[10,1,10,3],[10,6,10,7],[11,1,11,3],[11,6,11,7],[1,1,1,7],[4,1,4,7],[5,1,5,3],[7,1,7,7],[8,1,8,3],[8,6,8,7]]}
[]
[null,"【スイッチ❸】03.静的MACアドレステーブル "]
[]
[]
[null,"※予めデフォルト設定している項目があります。それら設定がお客様ご運用において正しいかを必ずご確認のうえ、本設定シートを作成してください。なお、本シートに記載できない内容はサービス提供範囲外となります。"]
[null,"静的MACアドレステーブル",null,null,{"$f":"⑪【スイッチ❸】01.システム設定!D28","v":"静的登録しない"}]
[]
[null,"■静的にMACアドレステーブルを登録します。\n　設定可能数は、最大512です。行挿入にてご利用ください。"]
[null,"宛先MACアドレス\n（hhhh.hhhh.hhhh形式）",null,null,"宛先MACアドレス\n宛てのフレーム転送\n・転送する(デフォルト)\n・破棄する","転送先VLAN-ID","転送先インタフェース"]
[null,"例)BCC3:42C4:0EEA",null,null,"転送する",10,"ge3"]

{"sheet":"⑪【スイッチ❹】01.システム設定","index":27,"n_rows":28,"n_cols":8,"rows_kept":28,"cut":false,"hidden":false,"merged":[[25,3,25,4],[26,3,26,4],[26,5,26,7],[27,3,27,4],[27,5,27,7],[22,1,22,2],[22,3,22,4],[22,5,22,7],[24,1,24,2],[24,3,24,4],[24,5,24,7],[19,5,19,6],[20,3,20,4],[20,5,20,7],[21,1,21,2],[21,3,21,4],[21,5,21,7],[18,5,18,6],[8,3,8,4],[8,5,8,7],[10,1,10,2],[10,3,10,7],[11,3,11,7],[13,1,13,2],[13,3,13,4],[13,5,13,7],[14,3,14,4],[14,5,14,7],[15,3,15,4],[16,3,16,4],[17,3,17,4],[1,1,1,7],[3,1,4,7],[6,1,6,2],[6,5,6,7],[7,3,7,4],[7,5,7,7]]}
[]
[null,"【スイッチ❹】01.システム設定 "]
[]
[null,"※予めデフォルト設定している項目があります。それら設定がお客様ご運用において正しいかを必ずご確認のうえ、本設定シートを作成してください。なお、本シートに記載できない内容はサービス提供範囲外となります。"]
[]
[]
[null,"機器情報",null,"設定値",null,"説明"]
[null,"機種"]
[null,"シリアル番号",null,null,null,"サービス側で記載します。"]
[]
[null,"設置場所",null,"記入欄"]
[null,"設置場所情報"]
[]
[null,"基本情報",null,"設定値",null,"説明"]
[null,"IPv4アドレス",null,null,null,"デフォルトVLAN#1のIPv4アドレス。\n（デフォルトは、192.168.100.240/24)\n管理用PCから本機にアクセスする際のIPv4アドレス"]
[null,"日付・時刻設定",null,null,null,"\"JST\"で変更不可。"]
[null,null,"時刻同期","有効",null,"デフォルト：有効"]
[null,null,"同期間隔",1,null,"デフォルト：１　[時間]　（範囲：１－２４）"]
[null,null,"NTPサーバ","☑","：L2MSマスタのIPアドレス",{"$f":"②【ルーター】システム設定!G12","v":"192.168.100.1"},null,"本機のみ設定時は、チェックを外してアドレスを設定してください"]
[null,null,null,{"$f":"IF(OR(①【ルーター】機能選択シート!$D$18=\"□\",$D$19=\"□\"),\"☑\",\"□\")","v":"☑"},"：アドレスを設定する",null,null,"デフォルト：ntp.nict.jp"]
[null,"管理パスワード",null,null,null,"空欄や“admin”が設定されている場合は“ password ”を設定致します。"]
[null,"デフォルトゲートウェイ",null,null,null,"NTPサーバを指定する場合、本設定が必要になるケースが多いです。"]
[null,"DNSサーバアドレス",null,null,null,"NTPサーバをFQDNで指定する場合、本設定が必要です。"]
[]
[null,"機能の選択",null,"利用有無",null,"説明"]
[null,"L2スイッティング機能"]
[null,null,"タグVLAN設定","利用しない",null,"利用する場合、「⑫【スイッチ】02.タグVLAN設定」シートに詳細情報をご記入ください。"]
[null,null,"静的MACアドレス\nテーブル","静的登録しない",null,"静的登録する場合、「⑬【スイッチ】03.静的MACアドレステーブル」シートに詳細情報をご記入ください。"]

{"sheet":"⑫【スイッチ❹】02.タグVLAN設定","index":28,"n_rows":69,"n_cols":8,"rows_kept":69,"cut":false,"hidden":false,"merged":[[67,5,67,6],[68,4,69,7],[61,5,61,6],[62,5,62,6],[63,5,63,6],[64,5,64,6],[65,5,65,6],[66,5,66,6],[60,5,60,6],[49,5,49,6],[50,5,50,6],[51,5,51,6],[52,5,52,6],[53,5,53,6],[54,5,54,6],[55,5,55,6],[56,5,56,6],[57,5,57,6],[58,5,58,6],[59,5,59,6],[48,5,48,6],[37,5,37,6],[38,5,38,6],[39,5,39,6],[40,5,40,6],[41,5,41,6],[42,5,42,6],[43,5,43,6],[44,5,44,6],[45,5,45,6],[46,5,46,6],[47,5,47,6],[36,5,36,6],[23,1,23,2],[24,1,24,2],[25,1,25,2],[26,1,26,2],[27,1,27,2],[28,1,28,2],[29,1,29,2],[30,1,30,2],[31,1,31,2],[32,1,32,2],[33,1,34,7],[22,1,22,2],[1,1,1,7],[3,5,4,5],[7,1,10,7],[13,1,13,7],[15,1,15,2],[16,1,16,2],[17,1,17,2],[18,1,18,2],[19,1,19,2],[20,1,20,2],[21,1,21,2]]}
[]
[null,"【スイッチ❹】02.タグVLAN設定 "]
[]
[null,null,null,null,null,{"$f":"⑪【スイッチ❹】01.システム設定!D8&\"\"","v":""}]
[]
[]
[]
[null,"※予めデフォルト設定している項目があります。それら設定がお客様ご運用において正しいかを必ずご確認のうえ、本設定シートを作成してください。なお、本シートに記載できない内容はサービス提供範囲外となります。\n※タグVLANかつスイッチオプション構成において、スイッチオプション配下の <デフォルトVLAN以外を設定したアクセスポート> ではセキュリティ対策ツールは使用できません。(IPv6の仕様上、/64より細かいサブネットの分割できないため)。セキュリティ対策ツールを使用する場合はルータのLANポートもしくは <デフォルトVLANを設定したアクセスポート> に接続ください。"]
[]
[]
[]
[null,"タグＶＬＡＮ",null,null,{"$f":"⑪【スイッチ❹】01.システム設定!D27","v":"利用しない"}]
[]
[null,"ここで作成したVLANで本ルータにアクセスするには、「【ルーター】タグVLAN設定」シートで同じVLAN-IDのタグVLAN設定が必要です。"]
[null,"VLAN名",null,"VLAN-ID(2-4096)","フレーム転送","IPアドレス設定方法","設定するIPアドレス","備考"]
[null,"default",null,1,"有効","設定する",{"$f":"⑪【スイッチ❹】01.システム設定!D15&\"\"","v":""},"VLAN名,VLAN-ID変更不可"]
[null,"例)VLAN0010",null,10,"有効","設定しない"]
[null,null,null,null,"有効","設定しない"]
[null,null,null,null,"有効","設定しない"]
[null,null,null,null,"有効","設定しない"]
[null,null,null,null,"有効","設定しない"]
[null,null,null,null,"有効","設定しない"]
[null,null,null,null,"有効","設定しない"]
[null,null,null,null,"有効","設定しない"]
[null,null,null,null,"有効","設定しない"]
[null,null,null,null,"有効","設定しない"]
[null,null,null,null,"有効","設定しない"]
[null,null,null,null,"有効","設定しない"]
[null,null,null,null,"有効","設定しない"]
[null,null,null,null,"有効","設定しない"]
[null,null,null,null,"有効","設定しない"]
[null,null,null,null,"有効","設定しない"]
[null,null,null,null,"有効","設定しない"]
[null,"※作成可能なVLAN数はデフォルトVLAN(VLAN-ID=1)を含めて最大256個です。\n※VLAN数が16個を超える場合は、設定行を追加してご利用ください。 \n※デフォルトVLAN(VLAN-ID=1) は、フレーム転送を無効にできません。 \n※VLANを作成するとIGMPスヌーピング機能も有効になります。"]
[]
[]
[null,"インタフェース",null,"動作モード\n・アクセス\n　（デフォルト）\n・トランク","所属ネイティブVLAN-ID\n（デフォルト：1）\nトランクモード時記入","所属VLAN\n・アクセスモード：１つのアクセスVLAN-IDを記入\n・トランクモード：１つ以上のアクセスVLAN-IDを記入",null,"イングレスフィルター\n（トランクモード時）"]
[null,"例) port1",null,"トランク",1,10,null,"有効"]
[null,"例) port2",null,"アクセス",null,1,null,"有効"]
[null,"例) port3",null,"アクセス",null,10,null,"有効"]
[null,{"$f":"IF(OR(F4=\"SWX2310-28GT\",F4=\"SWX2320-16MT\"),\"port1\",\"\")","v":""},null,null,null,null,null,"有効"]
[null,{"$f":"IF(OR(F4=\"SWX2310-28GT\",F4=\"SWX2320-16MT\"),\"port2\",\"\")","v":""},null,null,null,null,null,"有効"]
[null,{"$f":"IF(OR(F4=\"SWX2310-28GT\",F4=\"SWX2320-16MT\"),\"port3\",\"\")","v":""},null,null,null,null,null,"有効"]
[null,{"$f":"IF(OR(F4=\"SWX2310-28GT\",F4=\"SWX2320-16MT\"),\"port4\",\"\")","v":""},null,null,null,null,null,"有効"]
[null,{"$f":"IF(OR(F4=\"SWX2310-28GT\",F4=\"SWX2320-16MT\"),\"port5\",\"\")","v":""},null,null,null,null,null,"有効"]
[null,{"$f":"IF(OR(F4=\"SWX2310-28GT\",F4=\"SWX2320-16MT\"),\"port6\",\"\")","v":""},null,null,null,null,null,"有効"]
[null,{"$f":"IF(OR(F4=\"SWX2310-28GT\",F4=\"SWX2320-16MT\"),\"port7\",\"\")","v":""},null,null,null,null,null,"有効"]
[null,{"$f":"IF(OR(F4=\"SWX2310-28GT\",F4=\"SWX2320-16MT\"),\"port8\",\"\")","v":""},null,null,null,null,null,"有効"]
[null,{"$f":"IF(OR(F4=\"SWX2310-28GT\",F4=\"SWX2320-16MT\"),\"port9\",\"\")","v":""},null,null,null,null,null,"有効"]
[null,{"$f":"IF(OR(F4=\"SWX2310-28GT\",F4=\"SWX2320-16MT\"),\"port10\",\"\")","v":""},null,null,null,null,null,"有効"]
[null,{"$f":"IF(OR(F4=\"SWX2310-28GT\",F4=\"SWX2320-16MT\"),\"port11\",\"\")","v":""},null,null,null,null,null,"有効"]
[null,{"$f":"IF(OR(F4=\"SWX2310-28GT\",F4=\"SWX2320-16MT\"),\"port12\",\"\")","v":""},null,null,null,null,null,"有効"]
[null,{"$f":"IF(F4=\"SWX2310-28GT\",\"port13\",IF(F4=\"SWX2320-16MT\",\"port13(SFP+)\",\"\"))","v":""},null,null,null,null,null,"有効"]
[null,{"$f":"IF(F4=\"SWX2310-28GT\",\"port14\",IF(F4=\"SWX2320-16MT\",\"port14(SFP+)\",\"\"))","v":""},null,null,null,null,null,"有効"]
[null,{"$f":"IF(F4=\"SWX2310-28GT\",\"port15\",IF(F4=\"SWX2320-16MT\",\"port15(SFP+)\",\"\"))","v":""},null,null,null,null,null,"有効"]
[null,{"$f":"IF(F4=\"SWX2310-28GT\",\"port16\",IF(F4=\"SWX2320-16MT\",\"port16(SFP+)\",\"\"))","v":""},null,null,null,null,null,"有効"]
[null,{"$f":"IF(F4=\"SWX2310-28GT\",\"port17\",IF(F4=\"SWX2320-16MT\",\"\",\"\"))","v":""},null,null,null,null,null,"有効"]
[null,{"$f":"IF(F4=\"SWX2310-28GT\",\"port18\",IF(F4=\"SWX2320-16MT\",\"\",\"\"))","v":""},null,null,null,null,null,"有効"]
[null,{"$f":"IF(F4=\"SWX2310-28GT\",\"port19\",IF(F4=\"SWX2320-16MT\",\"\",\"\"))","v":""},null,null,null,null,null,"有効"]
[null,{"$f":"IF(F4=\"SWX2310-28GT\",\"port20\",IF(F4=\"SWX2320-16MT\",\"\",\"\"))","v":""},null,null,null,null,null,"有効"]
[null,{"$f":"IF(F4=\"SWX2310-28GT\",\"port21\",IF(F4=\"SWX2320-16MT\",\"\",\"\"))","v":""},null,null,null,null,null,"有効"]
[null,{"$f":"IF(F4=\"SWX2310-28GT\",\"port22\",IF(F4=\"SWX2320-16MT\",\"\",\"\"))","v":""},null,null,null,null,null,"有効"]
[null,{"$f":"IF(F4=\"SWX2310-28GT\",\"port23\",IF(F4=\"SWX2320-16MT\",\"\",\"\"))","v":""},null,null,null,null,null,"有効"]
[null,{"$f":"IF(F4=\"SWX2310-28GT\",\"port24\",IF(F4=\"SWX2320-16MT\",\"\",\"\"))","v":""},null,null,null,null,null,"有効"]
[null,{"$f":"IF(F4=\"SWX2310-28GT\",\"port25(SFP)\",IF(F4=\"SWX2320-16MT\",\"\",\"\"))","v":""},null,null,null,null,null,"有効"]
[null,{"$f":"IF(F4=\"SWX2310-28GT\",\"port26(SFP)\",IF(F4=\"SWX2320-16MT\",\"\",\"\"))","v":""},null,null,null,null,null,"有効"]
[null,{"$f":"IF(F4=\"SWX2310-28GT\",\"port27(SFP)\",IF(F4=\"SWX2320-16MT\",\"\",\"\"))","v":""},null,null,null,null,null,"有効"]
[null,{"$f":"IF(F4=\"SWX2310-28GT\",\"port28(SFP)\",IF(F4=\"SWX2320-16MT\",\"\",\"\"))","v":""},null,null,null,null,null,"有効"]
[null,"※イングレスフィルター",null,null,"　・ 有効 ( 受信フレームのVLAN IDと所属VLANが同じ場合のみ受信する )\n　・ 無効 ( 全てのフレームを受信する )"]

{"sheet":"⑬【スイッチ❹】03.静的MACアドレステーブル","index":29,"n_rows":10,"n_cols":7,"rows_kept":10,"cut":false,"hidden":false,"merged":[[43,1,43,3],[43,6,43,7],[44,1,44,3],[44,6,44,7],[40,1,40,3],[40,6,40,7],[41,1,41,3],[41,6,41,7],[42,1,42,3],[42,6,42,7],[37,1,37,3],[37,6,37,7],[38,1,38,3],[38,6,38,7],[39,1,39,3],[39,6,39,7],[34,1,34,3],[34,6,34,7],[35,1,35,3],[35,6,35,7],[36,1,36,3],[36,6,36,7],[30,1,30,3],[30,6,30,7],[32,1,32,3],[32,6,32,7],[33,1,33,3],[33,6,33,7],[27,1,27,3],[27,6,27,7],[28,1,28,3],[28,6,28,7],[29,1,29,3],[29,6,29,7],[24,1,24,3],[24,6,24,7],[25,1,25,3],[25,6,25,7],[26,1,26,3],[26,6,26,7],[21,1,21,3],[21,6,21,7],[22,1,22,3],[22,6,22,7],[23,1,23,3],[23,6,23,7],[18,1,18,3],[18,6,18,7],[19,1,19,3],[19,6,19,7],[20,1,20,3],[20,6,20,7],[15,1,15,3],[15,6,15,7],[16,1,16,3],[16,6,16,7],[17,1,17,3],[17,6,17,7],[12,1,12,3],[12,6,12,7],[13,1,13,3],[13,6,13,7],[14,1,14,3],[14,6,14,7],[9,1,9,3],[9,6,9,7],[10,1,10,3],[10,6,10,7],[11,1,11,3],[11,6,11,7],[1,1,1,7],[4,1,4,7],[5,1,5,3],[7,1,7,7],[8,1,8,3],[8,6,8,7]]}
[]
[null,"【スイッチ❹】03.静的MACアドレステーブル "]
[]
[]
[null,"※予めデフォルト設定している項目があります。それら設定がお客様ご運用において正しいかを必ずご確認のうえ、本設定シートを作成してください。なお、本シートに記載できない内容はサービス提供範囲外となります。"]
[null,"静的MACアドレステーブル",null,null,{"$f":"⑪【スイッチ❹】01.システム設定!D28","v":"静的登録しない"}]
[]
[null,"■静的にMACアドレステーブルを登録します。\n　設定可能数は、最大512です。行挿入にてご利用ください。"]
[null,"宛先MACアドレス\n（hhhh.hhhh.hhhh形式）",null,null,"宛先MACアドレス\n宛てのフレーム転送\n・転送する(デフォルト)\n・破棄する","転送先VLAN-ID","転送先インタフェース"]
[null,"例)BCC3:42C4:0EEA",null,null,"転送する",10,"ge3"]

{"sheet":"⑪【スイッチ➎】01.システム設定","index":30,"n_rows":28,"n_cols":8,"rows_kept":28,"cut":false,"hidden":false,"merged":[[25,3,25,4],[26,3,26,4],[26,5,26,7],[27,3,27,4],[27,5,27,7],[22,1,22,2],[22,3,22,4],[22,5,22,7],[24,1,24,2],[24,3,24,4],[24,5,24,7],[19,5,19,6],[20,3,20,4],[20,5,20,7],[21,1,21,2],[21,3,21,4],[21,5,21,7],[18,5,18,6],[8,3,8,4],[8,5,8,7],[10,1,10,2],[10,3,10,7],[11,3,11,7],[13,1,13,2],[13,3,13,4],[13,5,13,7],[14,3,14,4],[14,5,14,7],[15,3,15,4],[16,3,16,4],[17,3,17,4],[1,1,1,7],[3,1,4,7],[6,1,6,2],[6,5,6,7],[7,3,7,4],[7,5,7,7]]}
[]
[null,"【スイッチ➎】01.システム設定 "]
[]
[null,"※予めデフォルト設定している項目があります。それら設定がお客様ご運用において正しいかを必ずご確認のうえ、本設定シートを作成してください。なお、本シートに記載できない内容はサービス提供範囲外となります。"]
[]
[]
[null,"機器情報",null,"設定値",null,"説明"]
[null,"機種"]
[null,"シリアル番号",null,null,null,"サービス側で記載します。"]
[]
[null,"設置場所",null,"記入欄"]
[null,"設置場所情報"]
[]
[null,"基本情報",null,"設定値",null,"説明"]
[null,"IPv4アドレス",null,null,null,"デフォルトVLAN#1のIPv4アドレス。\n（デフォルトは、192.168.100.240/24)\n管理用PCから本機にアクセスする際のIPv4アドレス"]
[null,"日付・時刻設定",null,null,null,"\"JST\"で変更不可。"]
[null,null,"時刻同期","有効",null,"デフォルト：有効"]
[null,null,"同期間隔",1,null,"デフォルト：１　[時間]　（範囲：１－２４）"]
[null,null,"NTPサーバ","☑","：L2MSマスタのIPアドレス",{"$f":"②【ルーター】システム設定!G12","v":"192.168.100.1"},null,"本機のみ設定時は、チェックを外してアドレスを設定してください"]
[null,null,null,{"$f":"IF(OR(①【ルーター】機能選択シート!$D$18=\"□\",$D$19=\"□\"),\"☑\",\"□\")","v":"☑"},"：アドレスを設定する",null,null,"デフォルト：ntp.nict.jp"]
[null,"管理パスワード",null,null,null,"空欄や“admin”が設定されている場合は“ password ”を設定致します。"]
[null,"デフォルトゲートウェイ",null,null,null,"NTPサーバを指定する場合、本設定が必要になるケースが多いです。"]
[null,"DNSサーバアドレス",null,null,null,"NTPサーバをFQDNで指定する場合、本設定が必要です。"]
[]
[null,"機能の選択",null,"利用有無",null,"説明"]
[null,"L2スイッティング機能"]
[null,null,"タグVLAN設定","利用しない",null,"利用する場合、「⑫【スイッチ】02.タグVLAN設定」シートに詳細情報をご記入ください。"]
[null,null,"静的MACアドレス\nテーブル","静的登録しない",null,"静的登録する場合、「⑬【スイッチ】03.静的MACアドレステーブル」シートに詳細情報をご記入ください。"]

{"sheet":"⑫【スイッチ➎】02.タグVLAN設定","index":31,"n_rows":69,"n_cols":8,"rows_kept":69,"cut":false,"hidden":false,"merged":[[67,5,67,6],[68,4,69,7],[61,5,61,6],[62,5,62,6],[63,5,63,6],[64,5,64,6],[65,5,65,6],[66,5,66,6],[60,5,60,6],[49,5,49,6],[50,5,50,6],[51,5,51,6],[52,5,52,6],[53,5,53,6],[54,5,54,6],[55,5,55,6],[56,5,56,6],[57,5,57,6],[58,5,58,6],[59,5,59,6],[48,5,48,6],[37,5,37,6],[38,5,38,6],[39,5,39,6],[40,5,40,6],[41,5,41,6],[42,5,42,6],[43,5,43,6],[44,5,44,6],[45,5,45,6],[46,5,46,6],[47,5,47,6],[36,5,36,6],[23,1,23,2],[24,1,24,2],[25,1,25,2],[26,1,26,2],[27,1,27,2],[28,1,28,2],[29,1,29,2],[30,1,30,2],[31,1,31,2],[32,1,32,2],[33,1,34,7],[22,1,22,2],[1,1,1,7],[3,5,4,5],[7,1,10,7],[13,1,13,7],[15,1,15,2],[16,1,16,2],[17,1,17,2],[18,1,18,2],[19,1,19,2],[20,1,20,2],[21,1,21,2]]}
[]
[null,"【スイッチ➎】02.タグVLAN設定 "]
[]
[null,null,null,null,null,{"$f":"⑪【スイッチ➎】01.システム設定!D8&\"\"","v":""}]
[]
[]
[]
[null,"※予めデフォルト設定している項目があります。それら設定がお客様ご運用において正しいかを必ずご確認のうえ、本設定シートを作成してください。なお、本シートに記載できない内容はサービス提供範囲外となります。\n※タグVLANかつスイッチオプション構成において、スイッチオプション配下の <デフォルトVLAN以外を設定したアクセスポート> ではセキュリティ対策ツールは使用できません。(IPv6の仕様上、/64より細かいサブネットの分割できないため)。セキュリティ対策ツールを使用する場合はルータのLANポートもしくは <デフォルトVLANを設定したアクセスポート> に接続ください。"]
[]
[]
[]
[null,"タグＶＬＡＮ",null,null,{"$f":"⑪【スイッチ➎】01.システム設定!D27","v":"利用しない"}]
[]
[null,"ここで作成したVLANで本ルータにアクセスするには、「【ルーター】タグVLAN設定」シートで同じVLAN-IDのタグVLAN設定が必要です。"]
[null,"VLAN名",null,"VLAN-ID(2-4096)","フレーム転送","IPアドレス設定方法","設定するIPアドレス","備考"]
[null,"default",null,1,"有効","設定する",{"$f":"⑪【スイッチ➎】01.システム設定!D15&\"\"","v":""},"VLAN名,VLAN-ID変更不可"]
[null,"例)VLAN0010",null,10,"有効","設定しない"]
[null,null,null,null,"有効","設定しない"]
[null,null,null,null,"有効","設定しない"]
[null,null,null,null,"有効","設定しない"]
[null,null,null,null,"有効","設定しない"]
[null,null,null,null,"有効","設定しない"]
[null,null,null,null,"有効","設定しない"]
[null,null,null,null,"有効","設定しない"]
[null,null,null,null,"有効","設定しない"]
[null,null,null,null,"有効","設定しない"]
[null,null,null,null,"有効","設定しない"]
[null,null,null,null,"有効","設定しない"]
[null,null,null,null,"有効","設定しない"]
[null,null,null,null,"有効","設定しない"]
[null,null,null,null,"有効","設定しない"]
[null,null,null,null,"有効","設定しない"]
[null,null,null,null,"有効","設定しない"]
[null,"※作成可能なVLAN数はデフォルトVLAN(VLAN-ID=1)を含めて最大256個です。\n※VLAN数が16個を超える場合は、設定行を追加してご利用ください。 \n※デフォルトVLAN(VLAN-ID=1) は、フレーム転送を無効にできません。 \n※VLANを作成するとIGMPスヌーピング機能も有効になります。"]
[]
[]
[null,"インタフェース",null,"動作モード\n・アクセス\n　（デフォルト）\n・トランク","所属ネイティブVLAN-ID\n（デフォルト：1）\nトランクモード時記入","所属VLAN\n・アクセスモード：１つのアクセスVLAN-IDを記入\n・トランクモード：１つ以上のアクセスVLAN-IDを記入",null,"イングレスフィルター\n（トランクモード時）"]
[null,"例) port1",null,"トランク",1,10,null,"有効"]
[null,"例) port2",null,"アクセス",null,1,null,"有効"]
[null,"例) port3",null,"アクセス",null,10,null,"有効"]
[null,{"$f":"IF(OR(F4=\"SWX2310-28GT\",F4=\"SWX2320-16MT\"),\"port1\",\"\")","v":""},null,null,null,null,null,"有効"]
[null,{"$f":"IF(OR(F4=\"SWX2310-28GT\",F4=\"SWX2320-16MT\"),\"port2\",\"\")","v":""},null,null,null,null,null,"有効"]
[null,{"$f":"IF(OR(F4=\"SWX2310-28GT\",F4=\"SWX2320-16MT\"),\"port3\",\"\")","v":""},null,null,null,null,null,"有効"]
[null,{"$f":"IF(OR(F4=\"SWX2310-28GT\",F4=\"SWX2320-16MT\"),\"port4\",\"\")","v":""},null,null,null,null,null,"有効"]
[null,{"$f":"IF(OR(F4=\"SWX2310-28GT\",F4=\"SWX2320-16MT\"),\"port5\",\"\")","v":""},null,null,null,null,null,"有効"]
[null,{"$f":"IF(OR(F4=\"SWX2310-28GT\",F4=\"SWX2320-16MT\"),\"port6\",\"\")","v":""},null,null,null,null,null,"有効"]
[null,{"$f":"IF(OR(F4=\"SWX2310-28GT\",F4=\"SWX2320-16MT\"),\"port7\",\"\")","v":""},null,null,null,null,null,"有効"]
[null,{"$f":"IF(OR(F4=\"SWX2310-28GT\",F4=\"SWX2320-16MT\"),\"port8\",\"\")","v":""},null,null,null,null,null,"有効"]
[null,{"$f":"IF(OR(F4=\"SWX2310-28GT\",F4=\"SWX2320-16MT\"),\"port9\",\"\")","v":""},null,null,null,null,null,"有効"]
[null,{"$f":"IF(OR(F4=\"SWX2310-28GT\",F4=\"SWX2320-16MT\"),\"port10\",\"\")","v":""},null,null,null,null,null,"有効"]
[null,{"$f":"IF(OR(F4=\"SWX2310-28GT\",F4=\"SWX2320-16MT\"),\"port11\",\"\")","v":""},null,null,null,null,null,"有効"]
[null,{"$f":"IF(OR(F4=\"SWX2310-28GT\",F4=\"SWX2320-16MT\"),\"port12\",\"\")","v":""},null,null,null,null,null,"有効"]
[null,{"$f":"IF(F4=\"SWX2310-28GT\",\"port13\",IF(F4=\"SWX2320-16MT\",\"port13(SFP+)\",\"\"))","v":""},null,null,null,null,null,"有効"]
[null,{"$f":"IF(F4=\"SWX2310-28GT\",\"port14\",IF(F4=\"SWX2320-16MT\",\"port14(SFP+)\",\"\"))","v":""},null,null,null,null,null,"有効"]
[null,{"$f":"IF(F4=\"SWX2310-28GT\",\"port15\",IF(F4=\"SWX2320-16MT\",\"port15(SFP+)\",\"\"))","v":""},null,null,null,null,null,"有効"]
[null,{"$f":"IF(F4=\"SWX2310-28GT\",\"port16\",IF(F4=\"SWX2320-16MT\",\"port16(SFP+)\",\"\"))","v":""},null,null,null,null,null,"有効"]
[null,{"$f":"IF(F4=\"SWX2310-28GT\",\"port17\",IF(F4=\"SWX2320-16MT\",\"\",\"\"))","v":""},null,null,null,null,null,"有効"]
[null,{"$f":"IF(F4=\"SWX2310-28GT\",\"port18\",IF(F4=\"SWX2320-16MT\",\"\",\"\"))","v":""},null,null,null,null,null,"有効"]
[null,{"$f":"IF(F4=\"SWX2310-28GT\",\"port19\",IF(F4=\"SWX2320-16MT\",\"\",\"\"))","v":""},null,null,null,null,null,"有効"]
[null,{"$f":"IF(F4=\"SWX2310-28GT\",\"port20\",IF(F4=\"SWX2320-16MT\",\"\",\"\"))","v":""},null,null,null,null,null,"有効"]
[null,{"$f":"IF(F4=\"SWX2310-28GT\",\"port21\",IF(F4=\"SWX2320-16MT\",\"\",\"\"))","v":""},null,null,null,null,null,"有効"]
[null,{"$f":"IF(F4=\"SWX2310-28GT\",\"port22\",IF(F4=\"SWX2320-16MT\",\"\",\"\"))","v":""},null,null,null,null,null,"有効"]
[null,{"$f":"IF(F4=\"SWX2310-28GT\",\"port23\",IF(F4=\"SWX2320-16MT\",\"\",\"\"))","v":""},null,null,null,null,null,"有効"]
[null,{"$f":"IF(F4=\"SWX2310-28GT\",\"port24\",IF(F4=\"SWX2320-16MT\",\"\",\"\"))","v":""},null,null,null,null,null,"有効"]
[null,{"$f":"IF(F4=\"SWX2310-28GT\",\"port25(SFP)\",IF(F4=\"SWX2320-16MT\",\"\",\"\"))","v":""},null,null,null,null,null,"有効"]
[null,{"$f":"IF(F4=\"SWX2310-28GT\",\"port26(SFP)\",IF(F4=\"SWX2320-16MT\",\"\",\"\"))","v":""},null,null,null,null,null,"有効"]
[null,{"$f":"IF(F4=\"SWX2310-28GT\",\"port27(SFP)\",IF(F4=\"SWX2320-16MT\",\"\",\"\"))","v":""},null,null,null,null,null,"有効"]
[null,{"$f":"IF(F4=\"SWX2310-28GT\",\"port28(SFP)\",IF(F4=\"SWX2320-16MT\",\"\",\"\"))","v":""},null,null,null,null,null,"有効"]
[null,"※イングレスフィルター",null,null,"　・ 有効 ( 受信フレームのVLAN IDと所属VLANが同じ場合のみ受信する )\n　・ 無効 ( 全てのフレームを受信する )"]

{"sheet":"⑬【スイッチ➎】03.静的MACアドレステーブル","index":32,"n_rows":10,"n_cols":7,"rows_kept":10,"cut":false,"hidden":false,"merged":[[43,1,43,3],[43,6,43,7],[44,1,44,3],[44,6,44,7],[40,1,40,3],[40,6,40,7],[41,1,41,3],[41,6,41,7],[42,1,42,3],[42,6,42,7],[37,1,37,3],[37,6,37,7],[38,1,38,3],[38,6,38,7],[39,1,39,3],[39,6,39,7],[34,1,34,3],[34,6,34,7],[35,1,35,3],[35,6,35,7],[36,1,36,3],[36,6,36,7],[30,1,30,3],[30,6,30,7],[32,1,32,3],[32,6,32,7],[33,1,33,3],[33,6,33,7],[27,1,27,3],[27,6,27,7],[28,1,28,3],[28,6,28,7],[29,1,29,3],[29,6,29,7],[24,1,24,3],[24,6,24,7],[25,1,25,3],[25,6,25,7],[26,1,26,3],[26,6,26,7],[21,1,21,3],[21,6,21,7],[22,1,22,3],[22,6,22,7],[23,1,23,3],[23,6,23,7],[18,1,18,3],[18,6,18,7],[19,1,19,3],[19,6,19,7],[20,1,20,3],[20,6,20,7],[15,1,15,3],[15,6,15,7],[16,1,16,3],[16,6,16,7],[17,1,17,3],[17,6,17,7],[12,1,12,3],[12,6,12,7],[13,1,13,3],[13,6,13,7],[14,1,14,3],[14,6,14,7],[9,1,9,3],[9,6,9,7],[10,1,10,3],[10,6,10,7],[11,1,11,3],[11,6,11,7],[1,1,1,7],[4,1,4,7],[5,1,5,3],[7,1,7,7],[8,1,8,3],[8,6,8,7]]}
[]
[null,"【スイッチ➎】03.静的MACアドレステーブル "]
[]
[]
[null,"※予めデフォルト設定している項目があります。それら設定がお客様ご運用において正しいかを必ずご確認のうえ、本設定シートを作成してください。なお、本シートに記載できない内容はサービス提供範囲外となります。"]
[null,"静的MACアドレステーブル",null,null,{"$f":"⑪【スイッチ➎】01.システム設定!D28","v":"静的登録しない"}]
[]
[null,"■静的にMACアドレステーブルを登録します。\n　設定可能数は、最大512です。行挿入にてご利用ください。"]
[null,"宛先MACアドレス\n（hhhh.hhhh.hhhh形式）",null,null,"宛先MACアドレス\n宛てのフレーム転送\n・転送する(デフォルト)\n・破棄する","転送先VLAN-ID","転送先インタフェース"]
[null,"例)BCC3:42C4:0EEA",null,null,"転送する",10,"ge3"]

{"sheet":"ネットワーク構成図","index":33,"n_rows":8,"n_cols":2,"rows_kept":8,"cut":false,"hidden":false,"merged":[[1,1,1,30]]}
[null,"【様式-1】"]
[null,"ネットワーク構成図"]
[]
[]
[]
[null,"ルータに接続するフレッツ・VPNワイド網、他接続拠点、及びお客様ネットワーク側セグメントを含む全体構成をご記入してください"]
[null,"全体構成図の中に本パラメータシートによる申込対象ルータがわかるようにご記入下さい"]
[null,"申込書内容チェック、保守・サポート時の参考情報として利用します。適切なサポートが実施できるよう、可能な限り正しくご記入ください。"]

{"sheet":"ルーター設置場所","index":34,"n_rows":7,"n_cols":2,"rows_kept":7,"cut":false,"hidden":false,"merged":[[1,1,1,30]]}
[]
[null,"ルータ設置場所フロア図"]
[]
[null,"保守交換等で現地駆けつけ時の参考情報として利用します。適切なサポートが実施できるよう、可能な限り正しくご記入ください。"]
[null,"ルータ及びアクセス回線終端装置の設置場所をご記入下さい"]
[null,"フロア（建物名、階層）範囲でご記入下さい"]
[null,"同一回線（設場）に複数のレンタルルータが設置される場合は、全てのルータを記載し、本件のルータがどれかわかるようにすること"]